{"text_format":"1","workbook":"xlsx","n_sheets":18,"sheets":["Aide-Hilfe","Apprenti-Lehrling","08","09","10","11","12","01","02","03","04","05","06","07","08+","Année-Jahr","Texte","Données de base-Grunddaten"],"not_rendered":{"charts":0,"images":4,"macros":1,"external_links":0,"defined_names":101,"comments":0,"pivot_tables":0},"unopened":[],"bounds":{"document_bytes":16777216,"sheet_cells":100000,"rows_first":2000,"rows_last":500,"rows_between":2000,"halvings":0,"cell_chars":16384,"cell_head_chars":4096},"cells_cut":0,"cells_raw":0,"read":"whole","date_system":"1900"}

{"sheet":"Aide-Hilfe","index":0,"n_rows":50,"n_cols":17,"rows_kept":50,"cut":false,"hidden":false,"merged":[[49,1,49,6],[32,12,33,12],[32,13,33,13],[42,9,44,9],[43,12,45,16],[33,9,34,9],[32,14,33,14],[32,16,33,16],[44,1,44,6],[45,1,45,6],[8,9,9,9],[17,9,20,9],[48,1,48,6],[47,1,47,6],[42,1,42,6],[41,1,41,6],[46,1,46,6],[43,1,43,6],[10,9,16,9],[2,6,7,6],[4,12,4,16],[5,12,5,16],[6,12,6,16],[7,12,7,13],[2,7,7,7],[2,8,7,8],[2,9,6,9],[1,2,1,9],[0,1,0,9],[0,11,0,16],[2,12,2,13],[2,14,2,15],[2,1,7,1],[2,2,7,2],[2,3,7,3],[2,4,7,4],[2,5,7,5],[19,12,19,13],[26,12,26,13],[27,12,27,13],[40,1,40,6],[22,9,24,9],[26,9,27,9],[29,9,31,9],[35,9,38,9]]}
[null,{"$f":"'08'!B1","v":"Agenda"},null,null,null,null,null,null,null,null,null,{"$f":"'08'!L1","v":"Décompte salaire mensuel"}]
[null,{"$f":"'08'!B2","v":"Apprenti(e)"},{"$f":"TRIM(DB_Apprenti)","v":""}]
[400,{"$f":"DATE(DB_Annee,8,1)","v":"2023-08-01"},{"$f":"'08'!C3","v":"[ a-b-c-d-e-f-g-h-i ]"},{"$f":"'08'!D3","v":"Logis"},{"$f":"'08'!E3","v":"Déjeuner"},{"$f":"'08'!F3","v":"Dîner"},{"$f":"'08'!G3","v":"Souper "},{"$f":"'08'!H3","v":"Montant des\n Prestations en\n nature"},{"$f":"'08'!I3","v":"Montant\n modifié"},{"$f":"VLOOKUP(A3,Tb_Traduction,DB_Langue,FALSE)","v":"Vous ne devez remplir que les cellules jaunes !!!"},null,{"$f":"'08'!L3","v":"Mois : "},{"$f":"B3","v":"2023-08-01"},null,{"$f":"'08'!O3","v":"Année :"},{"$f":"'08'!P3","v":0},{"$f":"B3","v":"2023-08-01"}]
[null,null,{"$f":"'08'!C4","v":0},{"$f":"'08'!D4","v":0},{"$f":"'08'!E4","v":0},{"$f":"'08'!F4","v":0},{"$f":"'08'!G4","v":0},{"$f":"'08'!H4","v":0},{"$f":"'08'!I4","v":0}]
[null,null,{"$f":"'08'!C5","v":0},{"$f":"'08'!D5","v":0},{"$f":"'08'!E5","v":0},{"$f":"'08'!F5","v":0},{"$f":"'08'!G5","v":0},{"$f":"'08'!H5","v":0},{"$f":"'08'!I5","v":0},null,null,{"$f":"'08'!L5","v":"Maître d'apprentissage : "}]
[null,null,{"$f":"'08'!C6","v":0},{"$f":"'08'!D6","v":0},{"$f":"'08'!E6","v":0},{"$f":"'08'!F6","v":0},{"$f":"'08'!G6","v":0},{"$f":"'08'!H6","v":0},{"$f":"'08'!I6","v":0},null,null,{"$f":"'08'!L6","v":"Lieu : "}]
[null,null,{"$f":"'08'!C7","v":0},{"$f":"'08'!D7","v":0},{"$f":"'08'!E7","v":0},{"$f":"'08'!F7","v":0},{"$f":"'08'!G7","v":0},{"$f":"'08'!H7","v":0},{"$f":"'08'!I7","v":0},null,null,{"$f":"'08'!L7","v":"Apprenti : "}]
[null,null,{"$f":"'08'!C8","v":0},{"$f":"'08'!D8","v":0},{"$f":"'08'!E8","v":0},{"$f":"'08'!F8","v":0},{"$f":"'08'!G8","v":0},{"$f":"'08'!H8","v":0},{"$f":"'08'!I8","v":0},null,null,{"$f":"'08'!L8","v":"N° AVS : "},null,null,null,{"$f":"'08'!P8","v":"Date de naissance :"}]
[401,{"$f":"B3","v":"2023-08-01"},"a",null,null,null,null,{"$f":"IF(C9=\"a\",PN_Travail,IF(C9=\"b\",PN_CoursProf,IF(C9=\"c\",PN_CoursIE,IF(C9=\"d\",PN_Conge,IF(C9=\"e\",PN_Vacances,IF(C9=\"f\",PN_DemiJour,IF(C9=\"g\",PN_Accident,IF(C9=\"h\",PN_Maladie,0))))))))","v":33},{"$f":"H9+D9*PN_Logis+E9*PN_Dejeuner+F9*PN_Diner+G9*PN_Souper","v":33},{"$f":"VLOOKUP(A9,Tb_Traduction,DB_Langue,FALSE)","v":"Pour chaque jour du mois vous pouvez saisir ici la journée de l'apprenti"}]
[null,{"$f":"B9+1","v":"2023-08-02"},"d",null,null,null,null,11.5,{"$f":"H10+D10*PN_Logis+E10*PN_Dejeuner+F10*PN_Diner+G10*PN_Souper","v":11.5}]
[230,"2023-08-03","b",null,null,null,null,23,23,{"$f":"VLOOKUP(A12,Tb_Traduction,DB_Langue,FALSE)","v":"a = Journée de travail\nb = Journée de cours professionnels\nc = Journée de cours interentreprises\nd = Journée de congé\ne = Journée de vacances\nf = 1/2 jour de travail, 1/2 jour de congé\ng = Accident (jour entier)\nh = Maladie (jour entier)\ni = Armée"},null,{"$f":"'08'!L11","v":"Salaire brut"},{"$f":"'08'!M11","v":{"$error":"#N/A"}},null,null,null,{"$f":"IF(PN_EffMoy=0,Sa_BaseMensuelArrondi / H42 *C40,Sa_BaseMensuelArrondi*PN_SalMoyAout)","v":{"$error":"#N/A"}}]
[402,"2023-08-04","a",null,null,null,null,33,33,null,null,{"$f":"'08'!L12","v":"Prime, bonus, gratification"}]
[null,"2023-08-05","a",null,null,null,null,33,33,null,null,{"$f":"'08'!L13","v":"Salaire brut total"},null,null,null,null,{"$f":"SUM(Q11:Q12)","v":{"$error":"#N/A"}}]
[null,"2023-08-06","a",null,null,null,null,33,33]
[null,"2023-08-07","a",null,null,null,null,33,33,null,null,{"$f":"'08'!L15","v":"Déductions"},{"$f":"'08'!M15","v":"Part"},"%"]
[null,"2023-08-08","d",null,null,null,null,11.5,11.5,null,null,{"$f":"'08'!L16","v":"Cotisations AVS, AI, APG* : "},"1/2",5.0500000000000003E-2,null,{"$f":"$Q$13*N16","v":{"$error":"#N/A"}}]
[null,"2023-08-09","d",null,null,null,null,11.5,11.5,null,null,{"$f":"'08'!L17","v":"Cotisations AC* : "},"1/2",0.01,null,{"$f":"$Q$13*N17","v":{"$error":"#N/A"}}]
[403,"2023-08-10","x",null,null,null,null,0,0,{"$f":"VLOOKUP(A18,Tb_Traduction,DB_Langue,FALSE)","v":"Une cellule rouge indique une mauvaise saisie. Seules les valeurs a, b, c, d, e, f, g ou h peuvent être saisie ici."},null,{"$f":"'08'!L18","v":"Accident non profes.: "},"1/2",1.3599999999999999E-2,null,{"$f":"$Q$13*N18","v":{"$error":"#N/A"}}]
[null,"2023-08-11","a",null,null,null,null,33,33,null,null,{"$f":"'08'!L19","v":"Indemnité journalière MC : "},"1/2",6.4999999999999997E-3,null,{"$f":"$Q$13*N19","v":{"$error":"#N/A"}}]
[null,"2023-08-12","a",null,null,null,null,33,33,null,null,{"$f":"'08'!L20","v":"Autre déduction : "}]
[null,"2023-08-13","a",null,null,null,null,33,33,null,null,{"$f":"'08'!L21","v":{"$error":"#N/A"}},null,null,null,{"$f":"I40","v":794}]
[null,"2023-08-14","a",null,null,null,null,33,33,null,null,{"$f":"'08'!L22","v":"*) Dès le 1er janvier de l'année des 18 ans de l'apprenti(e)"}]
[404,"2023-08-15","a",null,null,null,null,33,33,{"$f":"VLOOKUP(A23,Tb_Traduction,DB_Langue,FALSE)","v":"Les cases rouges indiquent les prestations en nature décomptées pour la journée."}]
[null,"2023-08-16","c",null,null,null,null,23,23,null,null,{"$f":"'08'!L24","v":"A déduire"},null,null,null,null,{"$f":"INT((SUM(P16:P21)*20)+0.5)/20","v":{"$error":"#N/A"}}]
[null,"2023-08-17","b",null,null,null,null,23,23]
[null,"2023-08-18","a",null,null,null,null,33,33,null,null,{"$f":"'08'!L26","v":"Frais et remboursement"}]
[405,"2023-08-19","a",null,null,null,null,33,33,{"$f":"VLOOKUP(A27,Tb_Traduction,DB_Langue,FALSE)","v":"Le montant des prestations en nature est calculé automatiquement"},null,{"$f":"'08'!L27","v":"Frais : "}]
[null,"2023-08-20","a",null,null,null,null,33,33,null,null,{"$f":"'08'!L28","v":"Autre remboursement : "}]
[null,"2023-08-21","a",null,null,null,null,33,33]
[406,"2023-08-22","c",null,null,null,null,23,23,{"$f":"VLOOKUP(A30,Tb_Traduction,DB_Langue,FALSE)","v":"Pour chaque jour, vous pouvez ajouter ou soustraire une ou plusieurs prestations en nature "},null,{"$f":"'08'!L30","v":"A ajouter"},null,null,null,null,{"$f":"SUM(P27:P28)","v":0}]
[null,"2023-08-23","c",null,null,null,null,23,23]
[null,"2023-08-24","a",null,-1,2,1,33,57.5,null,null,{"$f":"'08'!L32","v":"Versement du mois"},null,null,null,null,{"$f":"Q13+Q30-Q24","v":{"$error":"#N/A"}}]
[null,"2023-08-25","e",null,null,null,null,11.5,11.5,null,null,null,{"$f":"'08'!M33","v":"Mois\ncourant"},{"$f":"'08'!N33","v":"Cumul mois\nprécédents"},{"$f":"'08'!O33","v":"Prévus\nannuellement"},null,{"$f":"'08'!Q33","v":"Solde\nactuel"}]
[407,"2023-08-26","e",null,null,null,null,11.5,11.5,{"$f":"VLOOKUP(A34,Tb_Traduction,DB_Langue,FALSE)","v":"Le montant modifié des prestations en nature est calculé automatiquement"},null,{"$f":"'08'!L34","v":"Décompte des jours"},{"$f":"'08'!M34","v":0},{"$f":"'08'!N34","v":0},{"$f":"'08'!O34","v":0},null,{"$f":"'08'!Q34","v":0}]
[null,"2023-08-27","e",null,null,null,null,11.5,11.5,null,null,{"$f":"'08'!L35","v":"Travail :"},{"$f":"H43","v":16},0,{"$f":"NJ_Travail","v":{"$error":"#N/A"}},null,{"$f":"O35-N35-M35","v":{"$error":"#N/A"}}]
[null,"2023-08-28","e",null,null,null,null,11.5,11.5,{"$f":"VLOOKUP(A37,Tb_Traduction,DB_Langue,FALSE)","v":"Le total mensuel des prestations en nature est reporté dans le décompte salaire du mois si on affiche le montant effectif du salaire en nature. Sinon on reporte le salaire en nature mensuel"},null,{"$f":"'08'!L36","v":"Cours prof. :"},3,0,{"$f":"NJ_CoursProf","v":{"$error":"#N/A"}},null,{"$error":"#N/A"}]
[408,"2023-08-29","c",null,null,null,null,23,23,null,null,{"$f":"'08'!L37","v":"Cours IE :"},4,0,{"$f":"NJ_CoursIE","v":{"$error":"#N/A"}},null,{"$error":"#N/A"}]
[null,"2023-08-30","a",null,null,null,null,33,33,null,null,{"$f":"'08'!L38","v":"Armée :"},{"$f":"H46","v":0},{"$f":"I46","v":0},{"$f":"NJ_CoursIE","v":{"$error":"#N/A"}},null,{"$f":"O38-N38-M38","v":{"$error":"#N/A"}}]
[null,"2023-08-31","b",null,null,null,null,23,23,null,null,{"$f":"'08'!L39","v":"Congés :"},{"$f":"H47","v":3},{"$f":"I47","v":0},{"$f":"NJ_Conge","v":{"$error":"#N/A"}},null,{"$error":"#N/A"}]
[null,{"$f":"'08'!B40","v":"Total"},{"$f":"COUNTIF(C9:C39,\"a\")+COUNTIF(C9:C39,\"b\")+COUNTIF(C9:C39,\"c\")+COUNTIF(C9:C39,\"d\")+COUNTIF(C9:C39,\"e\")+COUNTIF(C9:C39,\"f\")+COUNTIF(C9:C39,\"g\")+COUNTIF(C9:C39,\"h\")+COUNTIF(C9:C39,\"i\")","v":30},{"$f":"SUM(D9:D39)","v":0},-1,2,1,769.5,794,{"$f":"INT(((Sa_NatureMensuel / H42 *C40)*20)+0.5)/20","v":{"$error":"#N/A"}},null,{"$f":"'08'!L40","v":"Vacances :"},{"$f":"H48","v":4},0,{"$f":"NJ_Vacances","v":{"$error":"#N/A"}},null,{"$error":"#N/A"}]
[null,null,null,null,null,null,null,{"$f":"B3","v":"2023-08-01"},{"$f":"'08'!I41","v":"cumul"},null,null,{"$f":"'08'!L41","v":"Accident :"},0,0,0,null,0]
[null,{"$f":"'08'!B42","v":"Décompte des jours"},{"$f":"'08'!C42","v":{"$error":"#N/A"}},{"$f":"'08'!D42","v":{"$error":"#REF!"}},{"$f":"'08'!E42","v":{"$error":"#REF!"}},{"$f":"'08'!F42","v":{"$error":"#REF!"}},{"$f":"'08'!G42","v":{"$error":"#REF!"}},31,0,null,null,{"$f":"'08'!L42","v":"Maladie :"},0,0,0,null,0]
[409,{"$f":"'08'!B43","v":"Jours de travail (a) :"},{"$f":"'08'!C43","v":{"$error":"#N/A"}},{"$f":"'08'!D43","v":{"$error":"#REF!"}},{"$f":"'08'!E43","v":{"$error":"#REF!"}},{"$f":"'08'!F43","v":{"$error":"#REF!"}},{"$f":"'08'!G43","v":{"$error":"#REF!"}},{"$f":"COUNTIF(C9:C39,\"a\")+COUNTIF(C9:C39,\"f\")/2","v":16},0,{"$f":"VLOOKUP(A43,Tb_Traduction,DB_Langue,FALSE)","v":"Le décompte des jours est reporté dans le décompte salaire du mois"}]
[null,{"$f":"'08'!B44","v":"Cours professionnels (b) :"},{"$f":"'08'!C44","v":{"$error":"#N/A"}},{"$f":"'08'!D44","v":{"$error":"#REF!"}},{"$f":"'08'!E44","v":{"$error":"#REF!"}},{"$f":"'08'!F44","v":{"$error":"#REF!"}},{"$f":"'08'!G44","v":{"$error":"#REF!"}},{"$f":"COUNTIF(C9:C39,\"b\")","v":3},0,null,null,{"$f":"'08'!L44","v":"Remarques : "}]
[null,{"$f":"'08'!B45","v":"Cours interentreprises (c) :"},{"$f":"'08'!C45","v":{"$error":"#N/A"}},{"$f":"'08'!D45","v":{"$error":"#REF!"}},{"$f":"'08'!E45","v":{"$error":"#REF!"}},{"$f":"'08'!F45","v":{"$error":"#REF!"}},{"$f":"'08'!G45","v":{"$error":"#REF!"}},{"$f":"COUNTIF(C9:C39,\"c\")","v":4},0]
[null,{"$f":"'08'!B46","v":"Armée (i) :"},{"$f":"'08'!C46","v":{"$error":"#N/A"}},{"$f":"'08'!D46","v":{"$error":"#REF!"}},{"$f":"'08'!E46","v":{"$error":"#REF!"}},{"$f":"'08'!F46","v":{"$error":"#REF!"}},{"$f":"'08'!G46","v":{"$error":"#REF!"}},{"$f":"COUNTIF(C10:C40,\"i\")","v":0},0]
[null,{"$f":"'08'!B47","v":"Congé (d) :"},{"$f":"'08'!C47","v":{"$error":"#N/A"}},{"$f":"'08'!D47","v":{"$error":"#REF!"}},{"$f":"'08'!E47","v":{"$error":"#REF!"}},{"$f":"'08'!F47","v":{"$error":"#REF!"}},{"$f":"'08'!G47","v":{"$error":"#REF!"}},{"$f":"COUNTIF(C9:C39,\"d\")+COUNTIF(C9:C39,\"f\")/2","v":3},0]
[null,{"$f":"'08'!B48","v":"Vacances (e) :"},{"$f":"'08'!C48","v":{"$error":"#N/A"}},{"$f":"'08'!D48","v":{"$error":"#REF!"}},{"$f":"'08'!E48","v":{"$error":"#REF!"}},{"$f":"'08'!F48","v":{"$error":"#REF!"}},{"$f":"'08'!G48","v":{"$error":"#REF!"}},{"$f":"COUNTIF(C9:C39,\"e\")","v":4},0,null,null,{"$f":"'08'!L48","v":"Date :"},null,null,{"$f":"'08'!O48","v":"Maître d'apprentissage : "}]
[null,{"$f":"'08'!B49","v":"Accident (g) :"},{"$f":"'08'!C49","v":{"$error":"#N/A"}},{"$f":"'08'!D49","v":{"$error":"#REF!"}},{"$f":"'08'!E49","v":{"$error":"#REF!"}},{"$f":"'08'!F49","v":{"$error":"#REF!"}},{"$f":"'08'!G49","v":{"$error":"#REF!"}},{"$f":"COUNTIF(C9:C39,\"g\")","v":0},0]
[null,{"$f":"'08'!B50","v":"Maladie (h) :"},{"$f":"'08'!C50","v":{"$error":"#N/A"}},{"$f":"'08'!D50","v":{"$error":"#REF!"}},{"$f":"'08'!E50","v":{"$error":"#REF!"}},{"$f":"'08'!F50","v":{"$error":"#REF!"}},{"$f":"'08'!G50","v":{"$error":"#REF!"}},{"$f":"COUNTIF(C9:C39,\"h\")","v":0},0,null,null,null,null,null,{"$f":"'08'!O50","v":"Apprenti(e) : "}]

{"sheet":"Apprenti-Lehrling","index":1,"n_rows":59,"n_cols":12,"rows_kept":59,"cut":false,"hidden":false,"merged":[[32,3,32,4],[35,5,35,12],[9,2,9,4],[31,3,31,4],[30,3,30,4],[19,3,19,4],[27,3,27,4],[29,2,29,4],[35,2,35,4],[34,3,34,4],[26,3,26,4],[23,3,23,4],[14,3,14,7],[24,3,24,4],[2,2,2,4],[3,2,3,4],[4,2,4,4],[6,2,6,4],[58,3,58,4],[54,3,54,4],[55,3,55,4],[56,3,56,4],[57,3,57,4],[7,2,7,4],[8,2,8,4],[20,3,20,4],[33,3,33,4],[25,3,25,4],[12,8,12,12],[22,3,22,4],[21,3,21,4],[20,5,20,12],[17,2,17,4],[18,3,18,4],[21,8,21,12],[53,2,53,4],[40,2,40,4],[36,1,37,1],[37,3,37,4],[36,5,36,12],[38,1,39,1],[38,3,38,4],[36,2,36,4]]}
[100,{"$f":"VLOOKUP(A1,Tb_Traduction,DB_Langue,FALSE)","v":"Langue :"},"F",{"$f":"VLOOKUP(A1+1,Tb_Traduction,DB_Langue,FALSE)","v":"D ou F"},{"$f":"IF(C1=\"F\",2,3)","v":2},null,null,"Grangeneuve, 04.08.2023"]
[]
[110,{"$f":"VLOOKUP(A3,Tb_Traduction,DB_Langue,FALSE)","v":"Nom et prénom du maître d'apprentissage :"}]
[111,{"$f":"VLOOKUP(A4,Tb_Traduction,DB_Langue,FALSE)","v":"Adresse :"}]
[112,{"$f":"VLOOKUP(A5,Tb_Traduction,DB_Langue,FALSE)","v":"NPA et Lieu :"}]
[]
[120,{"$f":"VLOOKUP(A7,Tb_Traduction,DB_Langue,FALSE)","v":"Nom et prénom de l'apprenti(e) :"}]
[121,"Adresse :"]
[122,"NPA et Lieu :"]
[123,"N° AVS :"]
[124,"Date de naissance :"]
[125,"Soumis à l'AVS depuis :",{"$f":"DATE(YEAR(DB_DateNaissance)+18,1,1)","v":"1918-01-01"}]
[126,"Supplément de vacances jusqu'à 20 ans révolus :",{"$f":"ROUND(5*IF(DB_DateNaissance<DB_5Semaines,0,IF(DB_DateNaissance>DB_5SemainesPlus,1,(DB_DateNaissance-DB_5Semaines)/(DB_5SemainesPlus-DB_5Semaines+1))),0)","v":0},{"$f":"DATE(DB_Annee-20,8,15)","v":"2003-08-15"},{"$f":"DATE(DB_Annee-19,8,15)","v":"2004-08-15"},null,15,{"$f":"VLOOKUP(G13,Tb_Traduction,DB_Langue,FALSE)","v":"Les normes cantonales concernant les vacances sont consultables ici:"},"http://www.formationprof.ch/download/am4.pdf"]
[130,{"$f":"VLOOKUP(A14,Tb_Traduction,DB_Langue,FALSE)","v":"Année :"},2023]
[131,{"$f":"VLOOKUP(A15,Tb_Traduction,DB_Langue,FALSE)","v":"Année d'apprentissage :"},{"$f":"IF(ISERR(D16+0),D16,D16+0)","v":0},{"$f":"VLOOKUP(C15,DB_ListeAnneeApprentissage,2,FALSE)","v":{"$error":"#N/A"}}]
[133,{"$f":"VLOOKUP(A16,Tb_Traduction,DB_Langue,FALSE)","v":"Nombre de mois :"},{"$f":"HLOOKUP(DB_AnneeApprentissage,DB_DonneesDeBase,12,FALSE)","v":{"$error":"#N/A"}}]
[]
[140,null,{"$f":"VLOOKUP(A18,Tb_Traduction,DB_Langue,FALSE)","v":"Données salariales"}]
[141,null,{"$f":"VLOOKUP(A19,Tb_Traduction,DB_Langue,FALSE)","v":"Net"},{"$f":"VLOOKUP(A19+1,Tb_Traduction,DB_Langue,FALSE)","v":"Arrondi"}]
[143,{"$f":"VLOOKUP(A20,Tb_Traduction,DB_Langue,FALSE)","v":"Salaire annuel de base minimum :"},{"$f":"HLOOKUP(DB_AnneeApprentissage,DB_DonneesDeBase,2,FALSE)","v":{"$error":"#N/A"}},{"$f":"INT((20*C20)+0.5)/20","v":{"$error":"#N/A"}}]
[144,"Salaire annuel de base :",null,{"$f":"INT((20*C21)+0.5)/20","v":0},null,{"$f":"IF(Sa_BaseAnnuel=\"\",\"\",VLOOKUP(A21+5,Tb_Traduction,DB_Langue,FALSE))","v":""}]
[145,"Salaire mensuel de base :",{"$f":"Sa_BaseAnnuel/C16","v":{"$error":"#N/A"}},{"$f":"INT((20*C22)+0.5)/20","v":{"$error":"#N/A"}},null,null,14]
[146,"Salaire annuel en nature :",{"$f":"HLOOKUP(DB_AnneeApprentissage,DB_DonneesDeBase,3+PN_LogisOuiNon,FALSE)","v":{"$error":"#N/A"}},{"$f":"INT((20*C23)+0.5)/20","v":{"$error":"#N/A"}},null,null,1,{"$f":"VLOOKUP(G23,Tb_Traduction,DB_Langue,FALSE)","v":"Salaire et nombre de jours"},1,"2b","2f",3]
[147,"Salaire mensuel en nature :",{"$f":"Sa_NatureAnnuel/Nb_Mois","v":{"$error":"#N/A"}},{"$f":"INT((20*C24)+0.5)/20","v":{"$error":"#N/A"}},null,null,2,"Salaire annuel de base (minimum)",14100,15900,15900,14100]
[148,"Salaire mensuel moyen :",{"$f":"C22-C24","v":{"$error":"#N/A"}},{"$f":"D22-D24","v":{"$error":"#N/A"}},null,null,3,"Salaire annuel en nature (sans chambre)",{"$f":"I26-(I28*PN_Logis)","v":5279},{"$f":"J26-(J28*PN_Logis)","v":5279},{"$f":"K26-(K28*PN_Logis)","v":5239},{"$f":"L26-(L28*PN_Logis)","v":3504.5}]
[135,"Versement mensuel moyen :",{"$f":"DB_Annee","v":2023},{"$f":"C26+1","v":2024},null,null,4,"Salaire annuel en nature (avec chambre)",{"$f":"(PN_Logis*I28)+(PN_Dejeuner*(I31+I32+I33))+(PN_Diner*I33)+(PN_Souper*(I31+I32+I33))","v":9488},{"$f":"(PN_Logis*J28)+(PN_Dejeuner*(J31+J32+J33))+(PN_Diner*J33)+(PN_Souper*(J31+J32+J33))","v":9488},{"$f":"(PN_Logis*K28)+(PN_Dejeuner*(K31+K32+K33))+(PN_Diner*K33)+(PN_Souper*(K31+K32+K33))","v":9448},{"$f":"(PN_Logis*L28)+(PN_Dejeuner*(L32+L33))+(PN_Diner*L33)+(PN_Souper*(L32+L33))","v":7713.5}]
[136,"sans AVS, moins de 18 ans :",{"$f":"IF(PN_EffMoy=0,\"...\",INT(20*(Sa_VersementMensuelArrondi-(Sa_BaseMensuelArrondi*SUM(C58:C59)))+0.5)/20)","v":{"$error":"#N/A"}},{"$f":"IF(PN_EffMoy=0,\"...\",INT(20*(Sa_VersementMensuelArrondi-(Sa_BaseMensuelArrondi*SUM(D58:D59)))+0.5)/20)","v":{"$error":"#N/A"}},null,null,5,"Sal. annuel en nat. (chambre hors sem. bloc)",0,0,0,0]
[137,"avec AVS, dès 18 ans :",{"$f":"IF(PN_EffMoy=0,\"...\",INT(20*(Sa_VersementMensuelArrondi-(Sa_BaseMensuelArrondi*SUM(C56:C59)))+0.5)/20)","v":{"$error":"#N/A"}},{"$f":"IF(PN_EffMoy=0,\"...\",INT(20*(Sa_VersementMensuelArrondi-(Sa_BaseMensuelArrondi*SUM(D56:D59)))+0.5)/20)","v":{"$error":"#N/A"}},null,null,6,"Durée totale",{"$f":"IF(MOD(DB_Annee+1,4)=0,366,365)","v":366},{"$f":"IF(MOD(DB_Annee+1,4)=0,366,365)","v":366},{"$f":"IF(MOD(DB_Annee+1,4)=0,366,365)","v":366},{"$f":"IF(MOD(DB_Annee+1,4)=0,366,365)","v":366}]
[null,null,null,null,null,null,7,"Jours de congé",78,78,78,78]
[150,null,{"$f":"VLOOKUP(A30,Tb_Traduction,DB_Langue,FALSE)","v":"Prestations en nature"},null,null,null,8,"Vacances",{"$f":"22+DB_VacSup","v":22},{"$f":"22+DB_VacSup","v":22},{"$f":"22+DB_VacSup","v":22},{"$f":"22+DB_VacSup","v":22}]
[null,null,2023,{"$f":"C31+1","v":2024},null,null,9,"Cours professionnel",40,40,40,103]
[151,{"$f":"VLOOKUP(A32,Tb_Traduction,DB_Langue,FALSE)","v":"Logis :"},11.5,11.5,null,null,10,"Cours interentreprises",4,4,8,0]
[152,"Déjeuner :",3.5,3.5,null,null,11,{"$f":"VLOOKUP(G34,Tb_Traduction,DB_Langue,FALSE)","v":"Jours de travail"},{"$f":"I28-SUM(I29:I32)","v":222},{"$f":"J28-SUM(J29:J32)","v":222},{"$f":"K28-SUM(K29:K32)","v":218},{"$f":"L28-SUM(L29:L32)","v":163}]
[153,"Dîner :",10,10,null,null,12,{"$f":"VLOOKUP(G35,Tb_Traduction,DB_Langue,FALSE)","v":"Nombre de mois"},12,12,12,12]
[154,"Souper :",8,8,null,null,13]
[155,"Chambre à disposition (oui/non/bloc) :",null,null,null,{"$f":"IF(Sa_NatureAnnuel=0,VLOOKUP(A39+1,Tb_Traduction,DB_Langue,FALSE),\"\")","v":{"$error":"#N/A"}}]
[156,"Afficher dans le décompte le salaire en nature effectif ou mensuel (moyenne)",null,null,null,{"$f":"IF(AND(PN_EffMoy=1,Nb_Mois<>12),VLOOKUP(A39+2,Tb_Traduction,DB_Langue,FALSE),\"\")","v":{"$error":"#N/A"}}]
[null,null,{"$f":"VLOOKUP(C37,DB_ListeEffMoy,2,FALSE)","v":{"$error":"#N/A"}},{"$f":"IF(OR(C36=\"OUI\",C36=\"JA\"),1,IF(OR(C36=\"NON\",C36=\"NEIN\"),0,2))","v":2}]
[157,{"$f":"SUBSTITUTE(SUBSTITUTE(VLOOKUP(A39,Tb_Traduction,DB_Langue,FALSE),\"***1\",C31),\"***2\",D31)","v":"Si salaire en nature mensuel, indiquer la répartition des salaires août 2023 et 2024"},0.5,0.5]
[]
[160,null,{"$f":"VLOOKUP(A41,Tb_Traduction,DB_Langue,FALSE)","v":"Prestations en nature par jour"}]
[161,null,{"$f":"VLOOKUP(A42,Tb_Traduction,DB_Langue,FALSE)","v":"Nb. Jours"},2023,{"$f":"D42+1","v":2024}]
[162,{"$f":"VLOOKUP(A43,Tb_Traduction,DB_Langue,FALSE)","v":"Jours de travail :"},{"$f":"HLOOKUP(DB_AnneeApprentissage,DB_DonneesDeBase,11,FALSE)","v":{"$error":"#N/A"}},{"$f":"IF(PN_LogisOuiNon=0,0,PN_Logis)+PN_Dejeuner+PN_Souper+PN_Diner","v":33},{"$f":"IF(PN_LogisOuiNon=0,0,PN_Logis_Plus)+PN_Dejeuner_Plus+PN_Souper_Plus+PN_Diner_Plus","v":33}]
[163,"Cours professionnels :",{"$f":"HLOOKUP(DB_AnneeApprentissage,DB_DonneesDeBase,9,FALSE)","v":{"$error":"#N/A"}},{"$f":"IF(DB_AnneeApprentissage=3,IF(PN_LogisOuiNon=0,0,PN_Logis),IF(PN_LogisOuiNon=0,0,PN_Logis)+PN_Dejeuner+PN_Souper)","v":23},{"$f":"IF(DB_AnneeApprentissage=3,IF(PN_LogisOuiNon=0,0,PN_Logis_Plus),IF(PN_LogisOuiNon=0,0,PN_Logis_Plus)+PN_Dejeuner_Plus+PN_Souper_Plus)","v":23}]
[164,"Cours interentreprises :",{"$f":"HLOOKUP(DB_AnneeApprentissage,DB_DonneesDeBase,10,FALSE)","v":{"$error":"#N/A"}},{"$f":"IF(PN_LogisOuiNon=0,0,PN_Logis)+PN_Dejeuner+PN_Souper","v":23},{"$f":"IF(PN_LogisOuiNon=0,0,PN_Logis_Plus)+PN_Dejeuner_Plus+PN_Souper_Plus","v":23}]
[171,{"$f":"VLOOKUP(A46,Tb_Traduction,DB_Langue,FALSE)","v":"Armée :"},0,{"$f":"IF(PN_LogisOuiNon=0,0,PN_Logis)","v":11.5},{"$f":"IF(PN_LogisOuiNon=0,0,PN_Logis_Plus)","v":11.5}]
[165,"Congé :",{"$f":"HLOOKUP(DB_AnneeApprentissage,DB_DonneesDeBase,7,FALSE)","v":{"$error":"#N/A"}},{"$f":"IF(PN_LogisOuiNon=0,0,PN_Logis)","v":11.5},{"$f":"IF(PN_LogisOuiNon=0,0,PN_Logis_Plus)","v":11.5}]
[166,"Vacances :",{"$f":"HLOOKUP(DB_AnneeApprentissage,DB_DonneesDeBase,8,FALSE)","v":{"$error":"#N/A"}},{"$f":"IF(PN_LogisOuiNon=0,0,PN_Logis)","v":11.5},{"$f":"IF(PN_LogisOuiNon=0,0,PN_Logis_Plus)","v":11.5}]
[167,"1/2 jour (travail/congé) :",0,{"$f":"IF(PN_LogisOuiNon=1,PN_Logis,0)","v":0},{"$f":"IF(PN_LogisOuiNon=1,PN_Logis_Plus,0)","v":0}]
[168,"Accident :",0,{"$f":"PN_Conge","v":11.5},{"$f":"PN_Conge_Plus","v":11.5}]
[169,"Maladie :",0,{"$f":"PN_Conge","v":11.5},{"$f":"PN_Conge_Plus","v":11.5}]
[170,"Nb. de jours total :",{"$f":"SUM(C43:C51)","v":{"$error":"#N/A"}}]
[]
[180,null,{"$f":"VLOOKUP(A54,Tb_Traduction,DB_Langue,FALSE)","v":"Retenues sur le salaire"}]
[null,null,2023,{"$f":"C55+1","v":2024}]
[181,{"$f":"VLOOKUP(A56,Tb_Traduction,DB_Langue,FALSE)","v":"Cotisations AVS, AI, APG :"},5.2999999999999999E-2,5.2999999999999999E-2]
[182,{"$f":"VLOOKUP(A57,Tb_Traduction,DB_Langue,FALSE)","v":"Cotisations AC :"},1.0999999999999999E-2,1.0999999999999999E-2]
[183,{"$f":"VLOOKUP(A58,Tb_Traduction,DB_Langue,FALSE)","v":" Accident non professionnel :"},1.6070000000000001E-2,1.6070000000000001E-2]
[184,{"$f":"VLOOKUP(A59,Tb_Traduction,DB_Langue,FALSE)","v":"Indemnité journalière en cas de  maladie :"},4.4000000000000003E-3,4.4000000000000003E-3]

{"sheet":"08","index":2,"n_rows":50,"n_cols":17,"rows_kept":50,"cut":false,"hidden":false,"merged":[[0,1,0,9],[1,2,1,9],[41,1,41,6],[2,7,7,7],[2,8,7,8],[2,9,7,9],[2,6,7,6],[40,1,40,6],[2,5,7,5],[2,1,7,1],[2,2,7,2],[2,3,7,3],[32,15,33,15],[4,12,4,16],[5,12,5,16],[6,12,6,16],[7,12,7,13],[2,4,7,4],[0,11,0,16],[26,12,26,13],[27,12,27,13],[32,14,33,14],[32,16,33,16],[32,12,33,12],[32,13,33,13],[2,12,2,13],[2,14,2,15],[19,12,19,13],[43,12,45,16],[49,1,49,6],[44,1,44,6],[47,1,47,6],[48,1,48,6],[42,1,42,6],[43,1,43,6],[46,1,46,6],[45,1,45,6]]}
[200,{"$f":"VLOOKUP(A1,Tb_Traduction,DB_Langue,FALSE)","v":"Agenda"},null,null,null,null,null,null,null,null,null,{"$f":"VLOOKUP(A1+1,Tb_Traduction,DB_Langue,FALSE)","v":"Décompte salaire mensuel"}]
[202,{"$f":"VLOOKUP(A2,Tb_Traduction,DB_Langue,FALSE)","v":"Apprenti(e)"},{"$f":"\"- \" & TRIM(DB_Apprenti) & \" -\"","v":"-  -"}]
[203,{"$f":"DATE(DB_Annee,8,1)","v":"2023-08-01"},{"$f":"VLOOKUP(A4,Tb_Traduction,DB_Langue,FALSE)","v":"[ a-b-c-d-e-f-g-h-i ]"},{"$f":"VLOOKUP(A4+1,Tb_Traduction,DB_Langue,FALSE)","v":"Logis"},{"$f":"VLOOKUP(A4+2,Tb_Traduction,DB_Langue,FALSE)","v":"Déjeuner"},{"$f":"VLOOKUP(A4+3,Tb_Traduction,DB_Langue,FALSE)","v":"Dîner"},{"$f":"VLOOKUP(A4+4,Tb_Traduction,DB_Langue,FALSE)","v":"Souper "},{"$f":"VLOOKUP(A4+5,Tb_Traduction,DB_Langue,FALSE)","v":"Montant des\n Prestations en\n nature"},{"$f":"VLOOKUP(A4+6,Tb_Traduction,DB_Langue,FALSE)","v":"Montant\n modifié"},{"$f":"VLOOKUP(A4+7,Tb_Traduction,DB_Langue,FALSE)","v":"Commentaires \na = Jour de travail\nb = Jour de cours professionel\nc = Jour de cours interentreprises\nd = Jour de congé\ne = Jour de vacances\nf = 1/2 jour de travail, 1/2 jour de congé\ng = Accident (jour entier)\nh = Maladie (jour entier)\ni = Armée"},null,{"$f":"VLOOKUP(A3,Tb_Traduction,DB_Langue,FALSE)","v":"Mois : "},{"$f":"B3","v":"2023-08-01"},null,{"$f":"VLOOKUP(A3+1,Tb_Traduction,DB_Langue,FALSE)","v":"Année :"},null,{"$f":"B3","v":"2023-08-01"}]
[210]
[220,null,null,null,null,null,null,null,null,null,null,{"$f":"VLOOKUP(A5,Tb_Traduction,DB_Langue,FALSE)","v":"Maître d'apprentissage : "},{"$f":"TRIM(DB_Maitre)","v":""}]
[221,null,null,null,null,null,null,null,null,null,null,{"$f":"VLOOKUP(A6,Tb_Traduction,DB_Langue,FALSE)","v":"Lieu : "},{"$f":"TRIM(DB_MaitreLieu)","v":""}]
[222,null,null,null,null,null,null,null,null,null,null,{"$f":"VLOOKUP(A7,Tb_Traduction,DB_Langue,FALSE)","v":"Apprenti : "},{"$f":"TRIM(DB_Apprenti)","v":""}]
[223,null,null,null,null,null,null,null,null,null,null,{"$f":"VLOOKUP(A8,Tb_Traduction,DB_Langue,FALSE)","v":"N° AVS : "},{"$f":"TRIM(DB_AVS)","v":""},null,null,{"$f":"VLOOKUP(A8+1,Tb_Traduction,DB_Langue,FALSE)","v":"Date de naissance :"},{"$f":"IF(DB_DateNaissance=0,\"\",DB_DateNaissance)","v":""}]
[null,{"$f":"B3","v":"2023-08-01"},null,null,null,null,null,{"$f":"MAX(IF(C9=\"a\",PN_Travail,IF(C9=\"b\",PN_CoursProf,IF(C9=\"c\",PN_CoursIE,IF(C9=\"d\",PN_Conge,0)))),IF(C9=\"e\",PN_Vacances,IF(C9=\"f\",PN_DemiJour,IF(C9=\"g\",PN_Accident,IF(C9=\"h\",PN_Maladie,IF(C9=\"i\",PN_Armee,0))))))","v":0},{"$f":"H9+D9*PN_Logis+E9*PN_Dejeuner+F9*PN_Diner+G9*PN_Souper","v":0}]
[null,{"$f":"B9+1","v":"2023-08-02"},null,null,null,null,null,0,0]
[230,{"$f":"B10+1","v":"2023-08-03"},null,null,null,null,null,0,0,null,null,{"$f":"VLOOKUP(A11,Tb_Traduction,DB_Langue,FALSE)","v":"Salaire brut"},{"$f":"IF(PN_EffMoy=0,SUBSTITUTE(VLOOKUP(A11+1,Tb_Traduction,DB_Langue,FALSE),\"***\",TEXT(J40,\"0.00\")),\"\")","v":{"$error":"#N/A"}},null,null,null,{"$f":"IF(OR(PN_EffMoy=0,Nb_Mois<>12),Sa_BaseMensuelArrondi / H42 *C40,Sa_BaseMensuelArrondi*PN_SalMoyAout)","v":{"$error":"#N/A"}}]
[232,"2023-08-04",null,null,null,null,null,0,0,null,null,{"$f":"VLOOKUP(A12,Tb_Traduction,DB_Langue,FALSE)","v":"Prime, bonus, gratification"}]
[233,"2023-08-05",null,null,null,null,null,0,0,null,null,{"$f":"VLOOKUP(A13,Tb_Traduction,DB_Langue,FALSE)","v":"Salaire brut total"},null,null,null,null,{"$f":"SUM(Q11:Q12)","v":{"$error":"#N/A"}}]
[null,"2023-08-06",null,null,null,null,null,0,0]
[240,"2023-08-07",null,null,null,null,null,0,0,null,null,{"$f":"VLOOKUP(A15,Tb_Traduction,DB_Langue,FALSE)","v":"Déductions"},{"$f":"VLOOKUP(A15+1,Tb_Traduction,DB_Langue,FALSE)","v":"Part"},"%"]
[242,"2023-08-08",null,null,null,null,null,0,0,null,null,"Cotisations AVS, AI, APG* : ","1/2",{"$f":"IF(B3>=DB_SoumisAVS,RS_AVS,0)","v":5.2999999999999999E-2},null,{"$f":"$Q$13*N16","v":{"$error":"#N/A"}}]
[243,"2023-08-09",null,null,null,null,null,0,0,null,null,"Cotisations AC* : ","1/2",{"$f":"IF(B3>=DB_SoumisAVS,RS_AC,0)","v":1.0999999999999999E-2},null,{"$f":"$Q$13*N17","v":{"$error":"#N/A"}}]
[244,"2023-08-10",null,null,null,null,null,0,0,null,null,"Accident non profes.: ","1/1",{"$f":"RS_ANP","v":1.6070000000000001E-2},null,{"$f":"$Q$13*N18","v":{"$error":"#N/A"}}]
[245,"2023-08-11",null,null,null,null,null,0,0,null,null,"Indemnité journalière MC : ","1/2",{"$f":"RS_MC","v":4.4000000000000003E-3},null,{"$f":"$Q$13*N19","v":{"$error":"#N/A"}}]
[246,"2023-08-12",null,null,null,null,null,0,0,null,null,"Autre déduction : "]
[247,"2023-08-13",null,null,null,null,null,0,0,null,null,{"$f":"VLOOKUP(A21+PN_EffMoy,Tb_Traduction,DB_Langue,FALSE)","v":{"$error":"#N/A"}},null,null,null,{"$f":"IF(PN_EffMoy=0,I40,IF(Nb_Mois=12,Sa_NatureMensuelArrondi*PN_SalMoyAout,Sa_NatureMensuelArrondi*C40/H42))","v":{"$error":"#N/A"}}]
[249,"2023-08-14",null,null,null,null,null,0,0,null,null,"*) Dès le 1er janvier de l'année des 18 ans de l'apprenti(e)"]
[null,"2023-08-15",null,null,null,null,null,0,0]
[250,"2023-08-16",null,null,null,null,null,0,0,null,null,{"$f":"VLOOKUP(A24,Tb_Traduction,DB_Langue,FALSE)","v":"A déduire"},null,null,null,null,{"$f":"INT((SUM(P16:P21)*20)+0.5)/20","v":{"$error":"#N/A"}}]
[null,"2023-08-17",null,null,null,null,null,0,0]
[251,"2023-08-18",null,null,null,null,null,0,0,null,null,{"$f":"VLOOKUP(A26,Tb_Traduction,DB_Langue,FALSE)","v":"Frais et remboursement"}]
[252,"2023-08-19",null,null,null,null,null,0,0,null,null,{"$f":"VLOOKUP(A27,Tb_Traduction,DB_Langue,FALSE)","v":"Frais : "}]
[253,"2023-08-20",null,null,null,null,null,0,0,null,null,{"$f":"VLOOKUP(A28,Tb_Traduction,DB_Langue,FALSE)","v":"Autre remboursement : "}]
[null,"2023-08-21",null,null,null,null,null,0,0]
[254,"2023-08-22",null,null,null,null,null,0,0,null,null,{"$f":"VLOOKUP(A30,Tb_Traduction,DB_Langue,FALSE)","v":"A ajouter"},null,null,null,null,{"$f":"SUM(P27:P28)","v":0}]
[null,"2023-08-23",null,null,null,null,null,0,0]
[255,"2023-08-24",null,null,null,null,null,0,0,null,null,{"$f":"VLOOKUP(A32,Tb_Traduction,DB_Langue,FALSE)","v":"Versement du mois"},null,null,null,null,{"$f":"Q13+Q30-Q24","v":{"$error":"#N/A"}}]
[null,"2023-08-25",null,null,null,null,null,0,0,null,null,null,{"$f":"VLOOKUP(A34+1,Tb_Traduction,DB_Langue,FALSE)","v":"Mois\ncourant"},{"$f":"VLOOKUP(A34+2,Tb_Traduction,DB_Langue,FALSE)","v":"Cumul mois\nprécédents"},{"$f":"VLOOKUP(A34+3,Tb_Traduction,DB_Langue,FALSE)","v":"Prévus\nannuellement"},null,{"$f":"VLOOKUP(A34+4,Tb_Traduction,DB_Langue,FALSE)","v":"Solde\nactuel"}]
[260,"2023-08-26",null,null,null,null,null,0,0,null,null,{"$f":"VLOOKUP(A34,Tb_Traduction,DB_Langue,FALSE)","v":"Décompte des jours"}]
[265,"2023-08-27",null,null,null,null,null,0,0,null,null,{"$f":"VLOOKUP(A35,Tb_Traduction,DB_Langue,FALSE)","v":"Travail :"},{"$f":"H43","v":0},0,{"$f":"NJ_Travail","v":{"$error":"#N/A"}},null,{"$f":"O35-N35-M35","v":{"$error":"#N/A"}}]
[null,"2023-08-28",null,null,null,null,null,0,0,null,null,{"$f":"VLOOKUP(A35+1,Tb_Traduction,DB_Langue,FALSE)","v":"Cours prof. :"},0,0,{"$f":"NJ_CoursProf","v":{"$error":"#N/A"}},null,{"$error":"#N/A"}]
[null,"2023-08-29",null,null,null,null,null,0,0,null,null,{"$f":"VLOOKUP(A35+2,Tb_Traduction,DB_Langue,FALSE)","v":"Cours IE :"},0,0,{"$f":"NJ_CoursIE","v":{"$error":"#N/A"}},null,{"$error":"#N/A"}]
[null,"2023-08-30",null,null,null,null,null,0,0,null,null,{"$f":"VLOOKUP(A35+7,Tb_Traduction,DB_Langue,FALSE)","v":"Armée :"},{"$f":"H46","v":0},{"$f":"I46","v":0},{"$f":"NJ_Bloc","v":0},null,{"$f":"O38-N38-M38","v":0}]
[null,"2023-08-31",null,null,null,null,null,0,0,null,null,{"$f":"VLOOKUP(A35+3,Tb_Traduction,DB_Langue,FALSE)","v":"Congés :"},{"$f":"H47","v":0},0,{"$f":"NJ_Conge","v":{"$error":"#N/A"}},null,{"$error":"#N/A"}]
[275,{"$f":"VLOOKUP(A40,Tb_Traduction,DB_Langue,FALSE)","v":"Total"},{"$f":"COUNTIF(C9:C39,\"a\")+COUNTIF(C9:C39,\"b\")+COUNTIF(C9:C39,\"c\")+COUNTIF(C9:C39,\"d\")+COUNTIF(C9:C39,\"e\")+COUNTIF(C9:C39,\"f\")+COUNTIF(C9:C39,\"g\")+COUNTIF(C9:C39,\"h\")+COUNTIF(C9:C39,\"i\")","v":0},{"$f":"SUM(D9:D39)","v":0},0,0,0,0,0,{"$f":"INT(((Sa_NatureMensuel / H42 *C40)*20)+0.5)/20","v":{"$error":"#N/A"}},null,{"$f":"VLOOKUP(A35+4,Tb_Traduction,DB_Langue,FALSE)","v":"Vacances :"},0,0,{"$f":"NJ_Vacances","v":{"$error":"#N/A"}},null,{"$error":"#N/A"}]
[277,null,null,null,null,null,null,{"$f":"B3","v":"2023-08-01"},{"$f":"VLOOKUP(A41,Tb_Traduction,DB_Langue,FALSE)","v":"cumul"},null,null,{"$f":"VLOOKUP(A35+5,Tb_Traduction,DB_Langue,FALSE)","v":"Accident :"},0,0,0,null,0]
[280,{"$f":"VLOOKUP(A42,Tb_Traduction,DB_Langue,FALSE)","v":"Décompte des jours"},{"$f":"VLOOKUP(B42,Tb_Traduction,DB_Langue,FALSE)","v":{"$error":"#N/A"}},{"$f":"VLOOKUP(#REF!,Tb_Traduction,DB_Langue,FALSE)","v":{"$error":"#REF!"}},{"$error":"#REF!"},{"$error":"#REF!"},{"$error":"#REF!"},31,0,null,null,{"$f":"VLOOKUP(A35+6,Tb_Traduction,DB_Langue,FALSE)","v":"Maladie :"},0,0,0,null,0]
[281,"Jours de travail (a) :",{"$error":"#N/A"},{"$f":"VLOOKUP(#REF!,Tb_Traduction,DB_Langue,FALSE)","v":{"$error":"#REF!"}},{"$error":"#REF!"},{"$error":"#REF!"},{"$error":"#REF!"},{"$f":"COUNTIF(C9:C39,\"a\")+COUNTIF(C9:C39,\"f\")/2","v":0},0]
[282,"Cours professionnels (b) :",{"$error":"#N/A"},{"$f":"VLOOKUP(#REF!,Tb_Traduction,DB_Langue,FALSE)","v":{"$error":"#REF!"}},{"$error":"#REF!"},{"$error":"#REF!"},{"$error":"#REF!"},{"$f":"COUNTIF(C9:C39,\"b\")","v":0},0,null,null,{"$f":"VLOOKUP(A40+1,Tb_Traduction,DB_Langue,FALSE)","v":"Remarques : "}]
[285,"Cours interentreprises (c) :",{"$error":"#N/A"},{"$f":"VLOOKUP(#REF!,Tb_Traduction,DB_Langue,FALSE)","v":{"$error":"#REF!"}},{"$error":"#REF!"},{"$error":"#REF!"},{"$error":"#REF!"},{"$f":"COUNTIF(C9:C39,\"c\")","v":0},0]
[291,"Armée (i) :",{"$error":"#N/A"},{"$f":"VLOOKUP(#REF!,Tb_Traduction,DB_Langue,FALSE)","v":{"$error":"#REF!"}},{"$error":"#REF!"},{"$error":"#REF!"},{"$error":"#REF!"},{"$f":"COUNTIF(C9:C39,\"i\")","v":0},0]
[286,"Congé (d) :",{"$error":"#N/A"},{"$f":"VLOOKUP(#REF!,Tb_Traduction,DB_Langue,FALSE)","v":{"$error":"#REF!"}},{"$error":"#REF!"},{"$error":"#REF!"},{"$error":"#REF!"},{"$f":"COUNTIF(C9:C39,\"d\")+COUNTIF(C9:C39,\"f\")/2","v":0},0]
[288,"Vacances (e) :",{"$error":"#N/A"},{"$f":"VLOOKUP(#REF!,Tb_Traduction,DB_Langue,FALSE)","v":{"$error":"#REF!"}},{"$error":"#REF!"},{"$error":"#REF!"},{"$error":"#REF!"},{"$f":"COUNTIF(C9:C39,\"e\")","v":0},0,null,null,{"$f":"VLOOKUP(A44+1,Tb_Traduction,DB_Langue,FALSE)","v":"Date :"},null,null,{"$f":"VLOOKUP(A44+2,Tb_Traduction,DB_Langue,FALSE)","v":"Maître d'apprentissage : "}]
[289,"Accident (g) :",{"$error":"#N/A"},{"$f":"VLOOKUP(#REF!,Tb_Traduction,DB_Langue,FALSE)","v":{"$error":"#REF!"}},{"$error":"#REF!"},{"$error":"#REF!"},{"$error":"#REF!"},{"$f":"COUNTIF(C9:C39,\"g\")","v":0},0]
[290,"Maladie (h) :",{"$error":"#N/A"},{"$f":"VLOOKUP(#REF!,Tb_Traduction,DB_Langue,FALSE)","v":{"$error":"#REF!"}},{"$error":"#REF!"},{"$error":"#REF!"},{"$error":"#REF!"},{"$f":"COUNTIF(C9:C39,\"h\")","v":0},0,null,null,null,null,null,{"$f":"VLOOKUP(A47+1,Tb_Traduction,DB_Langue,FALSE)","v":"Apprenti(e) : "}]

{"sheet":"09","index":3,"n_rows":50,"n_cols":17,"rows_kept":50,"cut":false,"hidden":false,"merged":[[40,1,40,6],[41,1,41,6],[32,13,33,13],[32,12,33,12],[32,15,33,15],[32,14,33,14],[45,1,45,6],[49,1,49,6],[42,1,42,6],[46,1,46,6],[43,1,43,6],[44,1,44,6],[47,1,47,6],[48,1,48,6],[19,12,19,13],[26,12,26,13],[27,12,27,13],[6,12,6,16],[7,12,7,13],[43,12,45,16],[32,16,33,16],[2,7,7,7],[2,8,7,8],[2,5,7,5],[2,9,7,9],[4,12,4,16],[5,12,5,16],[1,2,1,9],[0,1,0,9],[0,11,0,16],[2,12,2,13],[2,14,2,15],[2,1,7,1],[2,2,7,2],[2,3,7,3],[2,4,7,4],[2,6,7,6]]}
[null,{"$f":"'08'!B1","v":"Agenda"},null,null,null,null,null,null,null,null,null,{"$f":"'08'!L1","v":"Décompte salaire mensuel"}]
[null,{"$f":"'08'!B2","v":"Apprenti(e)"},{"$f":"\"- \" & TRIM(DB_Apprenti) & \" -\"","v":"-  -"}]
[null,{"$f":"DATE(DB_Annee,9,1)","v":"2023-09-01"},{"$f":"'08'!C3","v":"[ a-b-c-d-e-f-g-h-i ]"},{"$f":"'08'!D3","v":"Logis"},{"$f":"'08'!E3","v":"Déjeuner"},{"$f":"'08'!F3","v":"Dîner"},{"$f":"'08'!G3","v":"Souper "},{"$f":"'08'!H3","v":"Montant des\n Prestations en\n nature"},{"$f":"'08'!I3","v":"Montant\n modifié"},{"$f":"'08'!J3","v":"Commentaires \na = Jour de travail\nb = Jour de cours professionel\nc = Jour de cours interentreprises\nd = Jour de congé\ne = Jour de vacances\nf = 1/2 jour de travail, 1/2 jour de congé\ng = Accident (jour entier)\nh = Maladie (jour entier)\ni = Armée"},null,{"$f":"'08'!L3","v":"Mois : "},{"$f":"B3","v":"2023-09-01"},null,{"$f":"'08'!O3","v":"Année :"},{"$f":"'08'!P3","v":0},{"$f":"B3","v":"2023-09-01"}]
[null,null,{"$f":"'08'!C4","v":0},{"$f":"'08'!D4","v":0},{"$f":"'08'!E4","v":0},{"$f":"'08'!F4","v":0},{"$f":"'08'!G4","v":0},{"$f":"'08'!H4","v":0},{"$f":"'08'!I4","v":0},{"$f":"'08'!J4","v":0}]
[null,null,{"$f":"'08'!C5","v":0},{"$f":"'08'!D5","v":0},{"$f":"'08'!E5","v":0},{"$f":"'08'!F5","v":0},{"$f":"'08'!G5","v":0},{"$f":"'08'!H5","v":0},{"$f":"'08'!I5","v":0},{"$f":"'08'!J5","v":0},null,{"$f":"'08'!L5","v":"Maître d'apprentissage : "},{"$f":"TRIM(DB_Maitre)","v":""}]
[null,null,{"$f":"'08'!C6","v":0},{"$f":"'08'!D6","v":0},{"$f":"'08'!E6","v":0},{"$f":"'08'!F6","v":0},{"$f":"'08'!G6","v":0},{"$f":"'08'!H6","v":0},{"$f":"'08'!I6","v":0},{"$f":"'08'!J6","v":0},null,{"$f":"'08'!L6","v":"Lieu : "},{"$f":"TRIM(DB_MaitreLieu)","v":""}]
[null,null,{"$f":"'08'!C7","v":0},{"$f":"'08'!D7","v":0},{"$f":"'08'!E7","v":0},{"$f":"'08'!F7","v":0},{"$f":"'08'!G7","v":0},{"$f":"'08'!H7","v":0},{"$f":"'08'!I7","v":0},{"$f":"'08'!J7","v":0},null,{"$f":"'08'!L7","v":"Apprenti : "},{"$f":"TRIM(DB_Apprenti)","v":""}]
[null,null,{"$f":"'08'!C8","v":0},{"$f":"'08'!D8","v":0},{"$f":"'08'!E8","v":0},{"$f":"'08'!F8","v":0},{"$f":"'08'!G8","v":0},{"$f":"'08'!H8","v":0},{"$f":"'08'!I8","v":0},{"$f":"'08'!J8","v":0},null,{"$f":"'08'!L8","v":"N° AVS : "},{"$f":"TRIM(DB_AVS)","v":""},null,null,{"$f":"'08'!P8","v":"Date de naissance :"},{"$f":"IF(DB_DateNaissance=0,\"\",DB_DateNaissance)","v":""}]
[null,{"$f":"B3","v":"2023-09-01"},null,null,null,null,null,{"$f":"MAX(IF(C9=\"a\",PN_Travail,IF(C9=\"b\",PN_CoursProf,IF(C9=\"c\",PN_CoursIE,IF(C9=\"d\",PN_Conge,0)))),IF(C9=\"e\",PN_Vacances,IF(C9=\"f\",PN_DemiJour,IF(C9=\"g\",PN_Accident,IF(C9=\"h\",PN_Maladie,IF(C9=\"i\",PN_Armee,0))))))","v":0},{"$f":"H9+D9*PN_Logis+E9*PN_Dejeuner+F9*PN_Diner+G9*PN_Souper","v":0}]
[null,{"$f":"B9+1","v":"2023-09-02"},null,null,null,null,null,0,{"$f":"H10+D10*PN_Logis+E10*PN_Dejeuner+F10*PN_Diner+G10*PN_Souper","v":0}]
[230,{"$f":"B10+1","v":"2023-09-03"},null,null,null,null,null,0,0,null,null,{"$f":"'08'!L11","v":"Salaire brut"},{"$f":"IF(PN_EffMoy=0,SUBSTITUTE(VLOOKUP(A11+1,Tb_Traduction,DB_Langue,FALSE),\"***\",TEXT(J40,\"0.00\")),\"\")","v":{"$error":"#N/A"}},null,null,null,{"$f":"IF(OR(PN_EffMoy=0,Nb_Mois<>12),Sa_BaseMensuelArrondi / H42 *C40,Sa_BaseMensuelArrondi)","v":{"$error":"#N/A"}}]
[null,"2023-09-04",null,null,null,null,null,0,0,null,null,{"$f":"'08'!L12","v":"Prime, bonus, gratification"}]
[null,"2023-09-05",null,null,null,null,null,0,0,null,null,{"$f":"'08'!L13","v":"Salaire brut total"},null,null,null,null,{"$f":"SUM(Q11:Q12)","v":{"$error":"#N/A"}}]
[null,"2023-09-06",null,null,null,null,null,0,0]
[null,"2023-09-07",null,null,null,null,null,0,0,null,null,{"$f":"'08'!L15","v":"Déductions"},{"$f":"'08'!M15","v":"Part"},"%"]
[null,"2023-09-08",null,null,null,null,null,0,0,null,null,{"$f":"'08'!L16","v":"Cotisations AVS, AI, APG* : "},"1/2",{"$f":"IF(B3>=DB_SoumisAVS,RS_AVS,0)","v":5.2999999999999999E-2},null,{"$f":"$Q$13*N16","v":{"$error":"#N/A"}}]
[null,"2023-09-09",null,null,null,null,null,0,0,null,null,{"$f":"'08'!L17","v":"Cotisations AC* : "},"1/2",{"$f":"IF(B3>=DB_SoumisAVS,RS_AC,0)","v":1.0999999999999999E-2},null,{"$f":"$Q$13*N17","v":{"$error":"#N/A"}}]
[null,"2023-09-10",null,null,null,null,null,0,0,null,null,{"$f":"'08'!L18","v":"Accident non profes.: "},"1/1",{"$f":"RS_ANP","v":1.6070000000000001E-2},null,{"$f":"$Q$13*N18","v":{"$error":"#N/A"}}]
[null,"2023-09-11",null,null,null,null,null,0,0,null,null,{"$f":"'08'!L19","v":"Indemnité journalière MC : "},"1/2",{"$f":"RS_MC","v":4.4000000000000003E-3},null,{"$f":"$Q$13*N19","v":{"$error":"#N/A"}}]
[null,"2023-09-12",null,null,null,null,null,0,0,null,null,{"$f":"'08'!L20","v":"Autre déduction : "}]
[null,"2023-09-13",null,null,null,null,null,0,0,null,null,{"$f":"'08'!L21","v":{"$error":"#N/A"}},null,null,null,{"$f":"IF(PN_EffMoy=0,I40,IF(Nb_Mois=12,Sa_NatureMensuelArrondi,Sa_NatureMensuelArrondi*C40/H42))","v":{"$error":"#N/A"}}]
[null,"2023-09-14",null,null,null,null,null,0,0,null,null,{"$f":"'08'!L22","v":"*) Dès le 1er janvier de l'année des 18 ans de l'apprenti(e)"}]
[null,"2023-09-15",null,null,null,null,null,0,0]
[null,"2023-09-16",null,null,null,null,null,0,0,null,null,{"$f":"'08'!L24","v":"A déduire"},null,null,null,null,{"$f":"INT((SUM(P16:P21)*20)+0.5)/20","v":{"$error":"#N/A"}}]
[null,"2023-09-17",null,null,null,null,null,0,0]
[null,"2023-09-18",null,null,null,null,null,0,0,null,null,{"$f":"'08'!L26","v":"Frais et remboursement"}]
[null,"2023-09-19",null,null,null,null,null,0,0,null,null,{"$f":"'08'!L27","v":"Frais : "}]
[null,"2023-09-20",null,null,null,null,null,0,0,null,null,{"$f":"'08'!L28","v":"Autre remboursement : "}]
[null,"2023-09-21",null,null,null,null,null,0,0]
[null,"2023-09-22",null,null,null,null,null,0,0,null,null,{"$f":"'08'!L30","v":"A ajouter"},null,null,null,null,{"$f":"SUM(P27:P28)","v":0}]
[null,"2023-09-23",null,null,null,null,null,0,0]
[null,"2023-09-24",null,null,null,null,null,0,0,null,null,{"$f":"'08'!L32","v":"Versement du mois"},null,null,null,null,{"$f":"Q13+Q30-Q24","v":{"$error":"#N/A"}}]
[null,"2023-09-25",null,null,null,null,null,0,0,null,null,null,{"$f":"'08'!M33","v":"Mois\ncourant"},{"$f":"'08'!N33","v":"Cumul mois\nprécédents"},{"$f":"'08'!O33","v":"Prévus\nannuellement"},null,{"$f":"'08'!Q33","v":"Solde\nactuel"}]
[null,"2023-09-26",null,null,null,null,null,0,0,null,null,{"$f":"'08'!L34","v":"Décompte des jours"},{"$f":"'08'!M34","v":0},{"$f":"'08'!N34","v":0},{"$f":"'08'!O34","v":0},null,{"$f":"'08'!Q34","v":0}]
[null,"2023-09-27",null,null,null,null,null,0,0,null,null,{"$f":"'08'!L35","v":"Travail :"},{"$f":"H43","v":0},0,{"$f":"NJ_Travail","v":{"$error":"#N/A"}},null,{"$f":"O35-N35-M35","v":{"$error":"#N/A"}}]
[null,"2023-09-28",null,null,null,null,null,0,0,null,null,{"$f":"'08'!L36","v":"Cours prof. :"},0,0,{"$f":"NJ_CoursProf","v":{"$error":"#N/A"}},null,{"$error":"#N/A"}]
[null,"2023-09-29",null,null,null,null,null,0,0,null,null,{"$f":"'08'!L37","v":"Cours IE :"},0,0,{"$f":"NJ_CoursIE","v":{"$error":"#N/A"}},null,{"$error":"#N/A"}]
[null,"2023-09-30",null,null,null,null,null,0,0,null,null,{"$f":"'08'!L38","v":"Armée :"},0,0,{"$f":"NJ_Bloc","v":0},null,0]
[null,null,null,null,null,null,null,0,0,null,null,{"$f":"'08'!L39","v":"Congés :"},{"$f":"H47","v":0},0,{"$f":"NJ_Conge","v":{"$error":"#N/A"}},null,{"$error":"#N/A"}]
[null,{"$f":"'08'!B40","v":"Total"},{"$f":"COUNTIF(C9:C39,\"a\")+COUNTIF(C9:C39,\"b\")+COUNTIF(C9:C39,\"c\")+COUNTIF(C9:C39,\"d\")+COUNTIF(C9:C39,\"e\")+COUNTIF(C9:C39,\"f\")+COUNTIF(C9:C39,\"g\")+COUNTIF(C9:C39,\"h\")+COUNTIF(C9:C39,\"i\")","v":0},{"$f":"SUM(D9:D39)","v":0},0,0,0,0,0,{"$f":"INT(((Sa_NatureMensuel / H42 *C40)*20)+0.5)/20","v":{"$error":"#N/A"}},null,{"$f":"'08'!L40","v":"Vacances :"},0,0,{"$f":"NJ_Vacances","v":{"$error":"#N/A"}},null,{"$error":"#N/A"}]
[null,null,null,null,null,null,null,{"$f":"B3","v":"2023-09-01"},{"$f":"'08'!I41","v":"cumul"},null,null,{"$f":"'08'!L41","v":"Accident :"},0,0,0,null,0]
[null,{"$f":"'08'!B42","v":"Décompte des jours"},{"$f":"'08'!C42","v":{"$error":"#N/A"}},{"$f":"'08'!D42","v":{"$error":"#REF!"}},{"$f":"'08'!E42","v":{"$error":"#REF!"}},{"$f":"'08'!F42","v":{"$error":"#REF!"}},{"$f":"'08'!G42","v":{"$error":"#REF!"}},30,{"$f":"SUM('08'!H42:I42)","v":31},null,null,{"$f":"'08'!L42","v":"Maladie :"},0,0,0,null,0]
[null,{"$f":"'08'!B43","v":"Jours de travail (a) :"},{"$f":"'08'!C43","v":{"$error":"#N/A"}},{"$f":"'08'!D43","v":{"$error":"#REF!"}},{"$f":"'08'!E43","v":{"$error":"#REF!"}},{"$f":"'08'!F43","v":{"$error":"#REF!"}},{"$f":"'08'!G43","v":{"$error":"#REF!"}},{"$f":"COUNTIF(C9:C39,\"a\")+COUNTIF(C9:C39,\"f\")/2","v":0},{"$f":"SUM('08'!H43:I43)","v":0}]
[null,{"$f":"'08'!B44","v":"Cours professionnels (b) :"},{"$f":"'08'!C44","v":{"$error":"#N/A"}},{"$f":"'08'!D44","v":{"$error":"#REF!"}},{"$f":"'08'!E44","v":{"$error":"#REF!"}},{"$f":"'08'!F44","v":{"$error":"#REF!"}},{"$f":"'08'!G44","v":{"$error":"#REF!"}},{"$f":"COUNTIF(C9:C39,\"b\")","v":0},{"$f":"SUM('08'!H44:I44)","v":0},null,null,{"$f":"'08'!L44","v":"Remarques : "}]
[null,{"$f":"'08'!B45","v":"Cours interentreprises (c) :"},{"$f":"'08'!C45","v":{"$error":"#N/A"}},{"$f":"'08'!D45","v":{"$error":"#REF!"}},{"$f":"'08'!E45","v":{"$error":"#REF!"}},{"$f":"'08'!F45","v":{"$error":"#REF!"}},{"$f":"'08'!G45","v":{"$error":"#REF!"}},{"$f":"COUNTIF(C9:C39,\"c\")","v":0},{"$f":"SUM('08'!H45:I45)","v":0}]
[null,{"$f":"'08'!B46","v":"Armée (i) :"},{"$f":"'08'!C46","v":{"$error":"#N/A"}},{"$f":"'08'!D46","v":{"$error":"#REF!"}},{"$f":"'08'!E46","v":{"$error":"#REF!"}},{"$f":"'08'!F46","v":{"$error":"#REF!"}},{"$f":"'08'!G46","v":{"$error":"#REF!"}},{"$f":"COUNTIF(C9:C39,\"i\")","v":0},{"$f":"SUM('08'!H46:I46)","v":0}]
[null,{"$f":"'08'!B47","v":"Congé (d) :"},{"$f":"'08'!C47","v":{"$error":"#N/A"}},{"$f":"'08'!D47","v":{"$error":"#REF!"}},{"$f":"'08'!E47","v":{"$error":"#REF!"}},{"$f":"'08'!F47","v":{"$error":"#REF!"}},{"$f":"'08'!G47","v":{"$error":"#REF!"}},{"$f":"COUNTIF(C9:C39,\"d\")+COUNTIF(C9:C39,\"f\")/2","v":0},{"$f":"SUM('08'!H47:I47)","v":0}]
[289,{"$f":"'08'!B48","v":"Vacances (e) :"},{"$f":"'08'!C48","v":{"$error":"#N/A"}},{"$f":"'08'!D48","v":{"$error":"#REF!"}},{"$f":"'08'!E48","v":{"$error":"#REF!"}},{"$f":"'08'!F48","v":{"$error":"#REF!"}},{"$f":"'08'!G48","v":{"$error":"#REF!"}},{"$f":"COUNTIF(C9:C39,\"e\")","v":0},{"$f":"SUM('08'!H48:I48)","v":0},null,null,{"$f":"'08'!L48","v":"Date :"},null,null,{"$f":"'08'!O48","v":"Maître d'apprentissage : "}]
[290,{"$f":"'08'!B49","v":"Accident (g) :"},{"$f":"'08'!C49","v":{"$error":"#N/A"}},{"$f":"'08'!D49","v":{"$error":"#REF!"}},{"$f":"'08'!E49","v":{"$error":"#REF!"}},{"$f":"'08'!F49","v":{"$error":"#REF!"}},{"$f":"'08'!G49","v":{"$error":"#REF!"}},{"$f":"COUNTIF(C9:C39,\"g\")","v":0},{"$f":"SUM('08'!H49:I49)","v":0}]
[291,{"$f":"'08'!B50","v":"Maladie (h) :"},{"$f":"'08'!C50","v":{"$error":"#N/A"}},{"$f":"'08'!D50","v":{"$error":"#REF!"}},{"$f":"'08'!E50","v":{"$error":"#REF!"}},{"$f":"'08'!F50","v":{"$error":"#REF!"}},{"$f":"'08'!G50","v":{"$error":"#REF!"}},{"$f":"COUNTIF(C9:C39,\"h\")","v":0},{"$f":"SUM('08'!H50:I50)","v":0},null,null,null,null,null,{"$f":"'08'!O50","v":"Apprenti(e) : "}]

{"sheet":"10","index":4,"n_rows":50,"n_cols":17,"rows_kept":50,"cut":false,"hidden":false,"merged":[[40,1,40,6],[41,1,41,6],[32,13,33,13],[32,12,33,12],[32,15,33,15],[32,14,33,14],[45,1,45,6],[49,1,49,6],[42,1,42,6],[46,1,46,6],[43,1,43,6],[44,1,44,6],[47,1,47,6],[48,1,48,6],[19,12,19,13],[26,12,26,13],[27,12,27,13],[6,12,6,16],[7,12,7,13],[43,12,45,16],[32,16,33,16],[2,7,7,7],[2,8,7,8],[2,5,7,5],[2,9,7,9],[4,12,4,16],[5,12,5,16],[1,2,1,9],[0,1,0,9],[0,11,0,16],[2,12,2,13],[2,14,2,15],[2,1,7,1],[2,2,7,2],[2,3,7,3],[2,4,7,4],[2,6,7,6]]}
[null,{"$f":"'08'!B1","v":"Agenda"},null,null,null,null,null,null,null,null,null,{"$f":"'08'!L1","v":"Décompte salaire mensuel"}]
[null,{"$f":"'08'!B2","v":"Apprenti(e)"},{"$f":"\"- \" & TRIM(DB_Apprenti) & \" -\"","v":"-  -"}]
[null,{"$f":"DATE(DB_Annee,10,1)","v":"2023-10-01"},{"$f":"'08'!C3","v":"[ a-b-c-d-e-f-g-h-i ]"},{"$f":"'08'!D3","v":"Logis"},{"$f":"'08'!E3","v":"Déjeuner"},{"$f":"'08'!F3","v":"Dîner"},{"$f":"'08'!G3","v":"Souper "},{"$f":"'08'!H3","v":"Montant des\n Prestations en\n nature"},{"$f":"'08'!I3","v":"Montant\n modifié"},{"$f":"'08'!J3","v":"Commentaires \na = Jour de travail\nb = Jour de cours professionel\nc = Jour de cours interentreprises\nd = Jour de congé\ne = Jour de vacances\nf = 1/2 jour de travail, 1/2 jour de congé\ng = Accident (jour entier)\nh = Maladie (jour entier)\ni = Armée"},null,{"$f":"'08'!L3","v":"Mois : "},{"$f":"B3","v":"2023-10-01"},null,{"$f":"'08'!O3","v":"Année :"},{"$f":"'08'!P3","v":0},{"$f":"B3","v":"2023-10-01"}]
[null,null,{"$f":"'08'!C4","v":0},{"$f":"'08'!D4","v":0},{"$f":"'08'!E4","v":0},{"$f":"'08'!F4","v":0},{"$f":"'08'!G4","v":0},{"$f":"'08'!H4","v":0},{"$f":"'08'!I4","v":0},{"$f":"'08'!J4","v":0}]
[null,null,{"$f":"'08'!C5","v":0},{"$f":"'08'!D5","v":0},{"$f":"'08'!E5","v":0},{"$f":"'08'!F5","v":0},{"$f":"'08'!G5","v":0},{"$f":"'08'!H5","v":0},{"$f":"'08'!I5","v":0},{"$f":"'08'!J5","v":0},null,{"$f":"'08'!L5","v":"Maître d'apprentissage : "},{"$f":"TRIM(DB_Maitre)","v":""}]
[null,null,{"$f":"'08'!C6","v":0},{"$f":"'08'!D6","v":0},{"$f":"'08'!E6","v":0},{"$f":"'08'!F6","v":0},{"$f":"'08'!G6","v":0},{"$f":"'08'!H6","v":0},{"$f":"'08'!I6","v":0},{"$f":"'08'!J6","v":0},null,{"$f":"'08'!L6","v":"Lieu : "},{"$f":"TRIM(DB_MaitreLieu)","v":""}]
[null,null,{"$f":"'08'!C7","v":0},{"$f":"'08'!D7","v":0},{"$f":"'08'!E7","v":0},{"$f":"'08'!F7","v":0},{"$f":"'08'!G7","v":0},{"$f":"'08'!H7","v":0},{"$f":"'08'!I7","v":0},{"$f":"'08'!J7","v":0},null,{"$f":"'08'!L7","v":"Apprenti : "},{"$f":"TRIM(DB_Apprenti)","v":""}]
[null,null,{"$f":"'08'!C8","v":0},{"$f":"'08'!D8","v":0},{"$f":"'08'!E8","v":0},{"$f":"'08'!F8","v":0},{"$f":"'08'!G8","v":0},{"$f":"'08'!H8","v":0},{"$f":"'08'!I8","v":0},{"$f":"'08'!J8","v":0},null,{"$f":"'08'!L8","v":"N° AVS : "},{"$f":"TRIM(DB_AVS)","v":""},null,null,{"$f":"'08'!P8","v":"Date de naissance :"},{"$f":"IF(DB_DateNaissance=0,\"\",DB_DateNaissance)","v":""}]
[null,{"$f":"B3","v":"2023-10-01"},null,null,null,null,null,{"$f":"MAX(IF(C9=\"a\",PN_Travail,IF(C9=\"b\",PN_CoursProf,IF(C9=\"c\",PN_CoursIE,IF(C9=\"d\",PN_Conge,0)))),IF(C9=\"e\",PN_Vacances,IF(C9=\"f\",PN_DemiJour,IF(C9=\"g\",PN_Accident,IF(C9=\"h\",PN_Maladie,IF(C9=\"i\",PN_Armee,0))))))","v":0},{"$f":"H9+D9*PN_Logis+E9*PN_Dejeuner+F9*PN_Diner+G9*PN_Souper","v":0}]
[null,{"$f":"B9+1","v":"2023-10-02"},null,null,null,null,null,{"$f":"IF(C10=\"a\",PN_Travail,IF(C10=\"b\",PN_CoursProf,IF(C10=\"c\",PN_CoursIE,IF(C10=\"d\",PN_Conge,IF(C10=\"e\",PN_Vacances,IF(C10=\"f\",PN_DemiJour,IF(C10=\"g\",PN_Accident,IF(C10=\"h\",PN_Maladie,0))))))))","v":0},{"$f":"H10+D10*PN_Logis+E10*PN_Dejeuner+F10*PN_Diner+G10*PN_Souper","v":0}]
[230,{"$f":"B10+1","v":"2023-10-03"},null,null,null,null,null,0,0,null,null,{"$f":"'08'!L11","v":"Salaire brut"},{"$f":"IF(PN_EffMoy=0,SUBSTITUTE(VLOOKUP(A11+1,Tb_Traduction,DB_Langue,FALSE),\"***\",TEXT(J40,\"0.00\")),\"\")","v":{"$error":"#N/A"}},null,null,null,{"$f":"IF(OR(PN_EffMoy=0,Nb_Mois<>12),Sa_BaseMensuelArrondi / H42 *C40,Sa_BaseMensuelArrondi)","v":{"$error":"#N/A"}}]
[null,"2023-10-04",null,null,null,null,null,0,0,null,null,{"$f":"'08'!L12","v":"Prime, bonus, gratification"}]
[null,"2023-10-05",null,null,null,null,null,0,0,null,null,{"$f":"'08'!L13","v":"Salaire brut total"},null,null,null,null,{"$f":"SUM(Q11:Q12)","v":{"$error":"#N/A"}}]
[null,"2023-10-06",null,null,null,null,null,0,0]
[null,"2023-10-07",null,null,null,null,null,0,0,null,null,{"$f":"'08'!L15","v":"Déductions"},{"$f":"'08'!M15","v":"Part"},"%"]
[null,"2023-10-08",null,null,null,null,null,0,0,null,null,{"$f":"'08'!L16","v":"Cotisations AVS, AI, APG* : "},"1/2",{"$f":"IF(B3>=DB_SoumisAVS,RS_AVS,0)","v":5.2999999999999999E-2},null,{"$f":"$Q$13*N16","v":{"$error":"#N/A"}}]
[null,"2023-10-09",null,null,null,null,null,0,0,null,null,{"$f":"'08'!L17","v":"Cotisations AC* : "},"1/2",{"$f":"IF(B3>=DB_SoumisAVS,RS_AC,0)","v":1.0999999999999999E-2},null,{"$f":"$Q$13*N17","v":{"$error":"#N/A"}}]
[null,"2023-10-10",null,null,null,null,null,0,0,null,null,{"$f":"'08'!L18","v":"Accident non profes.: "},"1/1",{"$f":"RS_ANP","v":1.6070000000000001E-2},null,{"$f":"$Q$13*N18","v":{"$error":"#N/A"}}]
[null,"2023-10-11",null,null,null,null,null,0,0,null,null,{"$f":"'08'!L19","v":"Indemnité journalière MC : "},"1/2",{"$f":"RS_MC","v":4.4000000000000003E-3},null,{"$f":"$Q$13*N19","v":{"$error":"#N/A"}}]
[null,"2023-10-12",null,null,null,null,null,0,0,null,null,{"$f":"'08'!L20","v":"Autre déduction : "}]
[null,"2023-10-13",null,null,null,null,null,0,0,null,null,{"$f":"'08'!L21","v":{"$error":"#N/A"}},null,null,null,{"$f":"IF(PN_EffMoy=0,I40,IF(Nb_Mois=12,Sa_NatureMensuelArrondi,Sa_NatureMensuelArrondi*C40/H42))","v":{"$error":"#N/A"}}]
[null,"2023-10-14",null,null,null,null,null,0,0,null,null,{"$f":"'08'!L22","v":"*) Dès le 1er janvier de l'année des 18 ans de l'apprenti(e)"}]
[null,"2023-10-15",null,null,null,null,null,0,0]
[null,"2023-10-16",null,null,null,null,null,0,0,null,null,{"$f":"'08'!L24","v":"A déduire"},null,null,null,null,{"$f":"INT((SUM(P16:P21)*20)+0.5)/20","v":{"$error":"#N/A"}}]
[null,"2023-10-17",null,null,null,null,null,0,0]
[null,"2023-10-18",null,null,null,null,null,0,0,null,null,{"$f":"'08'!L26","v":"Frais et remboursement"}]
[null,"2023-10-19",null,null,null,null,null,0,0,null,null,{"$f":"'08'!L27","v":"Frais : "}]
[null,"2023-10-20",null,null,null,null,null,0,0,null,null,{"$f":"'08'!L28","v":"Autre remboursement : "}]
[null,"2023-10-21",null,null,null,null,null,0,0]
[null,"2023-10-22",null,null,null,null,null,0,0,null,null,{"$f":"'08'!L30","v":"A ajouter"},null,null,null,null,{"$f":"SUM(P27:P28)","v":0}]
[null,"2023-10-23",null,null,null,null,null,0,0]
[null,"2023-10-24",null,null,null,null,null,0,0,null,null,{"$f":"'08'!L32","v":"Versement du mois"},null,null,null,null,{"$f":"Q13+Q30-Q24","v":{"$error":"#N/A"}}]
[null,"2023-10-25",null,null,null,null,null,0,0,null,null,null,{"$f":"'08'!M33","v":"Mois\ncourant"},{"$f":"'08'!N33","v":"Cumul mois\nprécédents"},{"$f":"'08'!O33","v":"Prévus\nannuellement"},null,{"$f":"'08'!Q33","v":"Solde\nactuel"}]
[null,"2023-10-26",null,null,null,null,null,0,0,null,null,{"$f":"'08'!L34","v":"Décompte des jours"},{"$f":"'08'!M34","v":0},{"$f":"'08'!N34","v":0},{"$f":"'08'!O34","v":0},null,{"$f":"'08'!Q34","v":0}]
[null,"2023-10-27",null,null,null,null,null,0,0,null,null,{"$f":"'08'!L35","v":"Travail :"},{"$f":"H43","v":0},0,{"$f":"NJ_Travail","v":{"$error":"#N/A"}},null,{"$f":"O35-N35-M35","v":{"$error":"#N/A"}}]
[null,"2023-10-28",null,null,null,null,null,0,0,null,null,{"$f":"'08'!L36","v":"Cours prof. :"},0,0,{"$f":"NJ_CoursProf","v":{"$error":"#N/A"}},null,{"$error":"#N/A"}]
[null,"2023-10-29",null,null,null,null,null,0,0,null,null,{"$f":"'08'!L37","v":"Cours IE :"},0,0,{"$f":"NJ_CoursIE","v":{"$error":"#N/A"}},null,{"$error":"#N/A"}]
[null,"2023-10-30",null,null,null,null,null,0,0,null,null,{"$f":"'08'!L38","v":"Armée :"},0,0,{"$f":"NJ_Bloc","v":0},null,0]
[null,{"$f":"B38+1","v":"2023-10-31"},null,null,null,null,null,0,0,null,null,{"$f":"'08'!L39","v":"Congés :"},{"$f":"H47","v":0},0,{"$f":"NJ_Conge","v":{"$error":"#N/A"}},null,{"$error":"#N/A"}]
[null,{"$f":"'08'!B40","v":"Total"},{"$f":"COUNTIF(C9:C39,\"a\")+COUNTIF(C9:C39,\"b\")+COUNTIF(C9:C39,\"c\")+COUNTIF(C9:C39,\"d\")+COUNTIF(C9:C39,\"e\")+COUNTIF(C9:C39,\"f\")+COUNTIF(C9:C39,\"g\")+COUNTIF(C9:C39,\"h\")+COUNTIF(C9:C39,\"i\")","v":0},{"$f":"SUM(D9:D39)","v":0},0,0,0,0,0,{"$f":"INT(((Sa_NatureMensuel / H42 *C40)*20)+0.5)/20","v":{"$error":"#N/A"}},null,{"$f":"'08'!L40","v":"Vacances :"},0,0,{"$f":"NJ_Vacances","v":{"$error":"#N/A"}},null,{"$error":"#N/A"}]
[null,null,null,null,null,null,null,{"$f":"B3","v":"2023-10-01"},{"$f":"'08'!I41","v":"cumul"},null,null,{"$f":"'08'!L41","v":"Accident :"},0,0,0,null,0]
[null,{"$f":"'08'!B42","v":"Décompte des jours"},{"$f":"'08'!C42","v":{"$error":"#N/A"}},{"$f":"'08'!D42","v":{"$error":"#REF!"}},{"$f":"'08'!E42","v":{"$error":"#REF!"}},{"$f":"'08'!F42","v":{"$error":"#REF!"}},{"$f":"'08'!G42","v":{"$error":"#REF!"}},31,{"$f":"SUM('09'!H42:I42)","v":61},null,null,{"$f":"'08'!L42","v":"Maladie :"},0,0,0,null,0]
[null,{"$f":"'08'!B43","v":"Jours de travail (a) :"},{"$f":"'08'!C43","v":{"$error":"#N/A"}},{"$f":"'08'!D43","v":{"$error":"#REF!"}},{"$f":"'08'!E43","v":{"$error":"#REF!"}},{"$f":"'08'!F43","v":{"$error":"#REF!"}},{"$f":"'08'!G43","v":{"$error":"#REF!"}},{"$f":"COUNTIF(C9:C39,\"a\")+COUNTIF(C9:C39,\"f\")/2","v":0},{"$f":"SUM('09'!H43:I43)","v":0}]
[null,{"$f":"'08'!B44","v":"Cours professionnels (b) :"},{"$f":"'08'!C44","v":{"$error":"#N/A"}},{"$f":"'08'!D44","v":{"$error":"#REF!"}},{"$f":"'08'!E44","v":{"$error":"#REF!"}},{"$f":"'08'!F44","v":{"$error":"#REF!"}},{"$f":"'08'!G44","v":{"$error":"#REF!"}},{"$f":"COUNTIF(C9:C39,\"b\")","v":0},{"$f":"SUM('09'!H44:I44)","v":0},null,null,{"$f":"'08'!L44","v":"Remarques : "}]
[null,{"$f":"'08'!B45","v":"Cours interentreprises (c) :"},{"$f":"'08'!C45","v":{"$error":"#N/A"}},{"$f":"'08'!D45","v":{"$error":"#REF!"}},{"$f":"'08'!E45","v":{"$error":"#REF!"}},{"$f":"'08'!F45","v":{"$error":"#REF!"}},{"$f":"'08'!G45","v":{"$error":"#REF!"}},{"$f":"COUNTIF(C9:C39,\"c\")","v":0},{"$f":"SUM('09'!H45:I45)","v":0}]
[null,{"$f":"'08'!B46","v":"Armée (i) :"},{"$f":"'08'!C46","v":{"$error":"#N/A"}},{"$f":"'08'!D46","v":{"$error":"#REF!"}},{"$f":"'08'!E46","v":{"$error":"#REF!"}},{"$f":"'08'!F46","v":{"$error":"#REF!"}},{"$f":"'08'!G46","v":{"$error":"#REF!"}},{"$f":"COUNTIF(C9:C39,\"i\")","v":0},{"$f":"SUM('09'!H46:I46)","v":0}]
[null,{"$f":"'08'!B47","v":"Congé (d) :"},{"$f":"'08'!C47","v":{"$error":"#N/A"}},{"$f":"'08'!D47","v":{"$error":"#REF!"}},{"$f":"'08'!E47","v":{"$error":"#REF!"}},{"$f":"'08'!F47","v":{"$error":"#REF!"}},{"$f":"'08'!G47","v":{"$error":"#REF!"}},{"$f":"COUNTIF(C9:C39,\"d\")+COUNTIF(C9:C39,\"f\")/2","v":0},{"$f":"SUM('09'!H47:I47)","v":0}]
[289,{"$f":"'08'!B48","v":"Vacances (e) :"},{"$f":"'08'!C48","v":{"$error":"#N/A"}},{"$f":"'08'!D48","v":{"$error":"#REF!"}},{"$f":"'08'!E48","v":{"$error":"#REF!"}},{"$f":"'08'!F48","v":{"$error":"#REF!"}},{"$f":"'08'!G48","v":{"$error":"#REF!"}},{"$f":"COUNTIF(C9:C39,\"e\")","v":0},{"$f":"SUM('09'!H48:I48)","v":0},null,null,{"$f":"'08'!L48","v":"Date :"},null,null,{"$f":"'08'!O48","v":"Maître d'apprentissage : "}]
[290,{"$f":"'08'!B49","v":"Accident (g) :"},{"$f":"'08'!C49","v":{"$error":"#N/A"}},{"$f":"'08'!D49","v":{"$error":"#REF!"}},{"$f":"'08'!E49","v":{"$error":"#REF!"}},{"$f":"'08'!F49","v":{"$error":"#REF!"}},{"$f":"'08'!G49","v":{"$error":"#REF!"}},{"$f":"COUNTIF(C9:C39,\"g\")","v":0},{"$f":"SUM('09'!H49:I49)","v":0}]
[291,{"$f":"'08'!B50","v":"Maladie (h) :"},{"$f":"'08'!C50","v":{"$error":"#N/A"}},{"$f":"'08'!D50","v":{"$error":"#REF!"}},{"$f":"'08'!E50","v":{"$error":"#REF!"}},{"$f":"'08'!F50","v":{"$error":"#REF!"}},{"$f":"'08'!G50","v":{"$error":"#REF!"}},{"$f":"COUNTIF(C9:C39,\"h\")","v":0},{"$f":"SUM('09'!H50:I50)","v":0},null,null,null,null,null,{"$f":"'08'!O50","v":"Apprenti(e) : "}]

{"sheet":"11","index":5,"n_rows":50,"n_cols":17,"rows_kept":50,"cut":false,"hidden":false,"merged":[[40,1,40,6],[41,1,41,6],[32,13,33,13],[32,12,33,12],[32,15,33,15],[32,14,33,14],[45,1,45,6],[49,1,49,6],[42,1,42,6],[46,1,46,6],[43,1,43,6],[44,1,44,6],[47,1,47,6],[48,1,48,6],[19,12,19,13],[26,12,26,13],[27,12,27,13],[6,12,6,16],[7,12,7,13],[43,12,45,16],[32,16,33,16],[2,7,7,7],[2,8,7,8],[2,5,7,5],[2,9,7,9],[4,12,4,16],[5,12,5,16],[1,2,1,9],[0,1,0,9],[0,11,0,16],[2,12,2,13],[2,14,2,15],[2,1,7,1],[2,2,7,2],[2,3,7,3],[2,4,7,4],[2,6,7,6]]}
[null,{"$f":"'08'!B1","v":"Agenda"},null,null,null,null,null,null,null,null,null,{"$f":"'08'!L1","v":"Décompte salaire mensuel"}]
[null,{"$f":"'08'!B2","v":"Apprenti(e)"},{"$f":"\"- \" & TRIM(DB_Apprenti) & \" -\"","v":"-  -"}]
[null,{"$f":"DATE(DB_Annee,11,1)","v":"2023-11-01"},{"$f":"'08'!C3","v":"[ a-b-c-d-e-f-g-h-i ]"},{"$f":"'08'!D3","v":"Logis"},{"$f":"'08'!E3","v":"Déjeuner"},{"$f":"'08'!F3","v":"Dîner"},{"$f":"'08'!G3","v":"Souper "},{"$f":"'08'!H3","v":"Montant des\n Prestations en\n nature"},{"$f":"'08'!I3","v":"Montant\n modifié"},{"$f":"'08'!J3","v":"Commentaires \na = Jour de travail\nb = Jour de cours professionel\nc = Jour de cours interentreprises\nd = Jour de congé\ne = Jour de vacances\nf = 1/2 jour de travail, 1/2 jour de congé\ng = Accident (jour entier)\nh = Maladie (jour entier)\ni = Armée"},null,{"$f":"'08'!L3","v":"Mois : "},{"$f":"B3","v":"2023-11-01"},null,{"$f":"'08'!O3","v":"Année :"},{"$f":"'08'!P3","v":0},{"$f":"B3","v":"2023-11-01"}]
[null,null,{"$f":"'08'!C4","v":0},{"$f":"'08'!D4","v":0},{"$f":"'08'!E4","v":0},{"$f":"'08'!F4","v":0},{"$f":"'08'!G4","v":0},{"$f":"'08'!H4","v":0},{"$f":"'08'!I4","v":0},{"$f":"'08'!J4","v":0}]
[null,null,{"$f":"'08'!C5","v":0},{"$f":"'08'!D5","v":0},{"$f":"'08'!E5","v":0},{"$f":"'08'!F5","v":0},{"$f":"'08'!G5","v":0},{"$f":"'08'!H5","v":0},{"$f":"'08'!I5","v":0},{"$f":"'08'!J5","v":0},null,{"$f":"'08'!L5","v":"Maître d'apprentissage : "},{"$f":"TRIM(DB_Maitre)","v":""}]
[null,null,{"$f":"'08'!C6","v":0},{"$f":"'08'!D6","v":0},{"$f":"'08'!E6","v":0},{"$f":"'08'!F6","v":0},{"$f":"'08'!G6","v":0},{"$f":"'08'!H6","v":0},{"$f":"'08'!I6","v":0},{"$f":"'08'!J6","v":0},null,{"$f":"'08'!L6","v":"Lieu : "},{"$f":"TRIM(DB_MaitreLieu)","v":""}]
[null,null,{"$f":"'08'!C7","v":0},{"$f":"'08'!D7","v":0},{"$f":"'08'!E7","v":0},{"$f":"'08'!F7","v":0},{"$f":"'08'!G7","v":0},{"$f":"'08'!H7","v":0},{"$f":"'08'!I7","v":0},{"$f":"'08'!J7","v":0},null,{"$f":"'08'!L7","v":"Apprenti : "},{"$f":"TRIM(DB_Apprenti)","v":""}]
[null,null,{"$f":"'08'!C8","v":0},{"$f":"'08'!D8","v":0},{"$f":"'08'!E8","v":0},{"$f":"'08'!F8","v":0},{"$f":"'08'!G8","v":0},{"$f":"'08'!H8","v":0},{"$f":"'08'!I8","v":0},{"$f":"'08'!J8","v":0},null,{"$f":"'08'!L8","v":"N° AVS : "},{"$f":"TRIM(DB_AVS)","v":""},null,null,{"$f":"'08'!P8","v":"Date de naissance :"},{"$f":"IF(DB_DateNaissance=0,\"\",DB_DateNaissance)","v":""}]
[null,{"$f":"B3","v":"2023-11-01"},null,null,null,null,null,{"$f":"MAX(IF(C9=\"a\",PN_Travail,IF(C9=\"b\",PN_CoursProf,IF(C9=\"c\",PN_CoursIE,IF(C9=\"d\",PN_Conge,0)))),IF(C9=\"e\",PN_Vacances,IF(C9=\"f\",PN_DemiJour,IF(C9=\"g\",PN_Accident,IF(C9=\"h\",PN_Maladie,IF(C9=\"i\",PN_Armee,0))))))","v":0},{"$f":"H9+D9*PN_Logis+E9*PN_Dejeuner+F9*PN_Diner+G9*PN_Souper","v":0}]
[null,{"$f":"B9+1","v":"2023-11-02"},null,null,null,null,null,0,{"$f":"H10+D10*PN_Logis+E10*PN_Dejeuner+F10*PN_Diner+G10*PN_Souper","v":0}]
[230,{"$f":"B10+1","v":"2023-11-03"},null,null,null,null,null,0,0,null,null,{"$f":"'08'!L11","v":"Salaire brut"},{"$f":"IF(PN_EffMoy=0,SUBSTITUTE(VLOOKUP(A11+1,Tb_Traduction,DB_Langue,FALSE),\"***\",TEXT(J40,\"0.00\")),\"\")","v":{"$error":"#N/A"}},null,null,null,{"$f":"IF(OR(PN_EffMoy=0,Nb_Mois<>12),Sa_BaseMensuelArrondi / H42 *C40,Sa_BaseMensuelArrondi)","v":{"$error":"#N/A"}}]
[null,"2023-11-04",null,null,null,null,null,0,0,null,null,{"$f":"'08'!L12","v":"Prime, bonus, gratification"}]
[null,"2023-11-05",null,null,null,null,null,0,0,null,null,{"$f":"'08'!L13","v":"Salaire brut total"},null,null,null,null,{"$f":"SUM(Q11:Q12)","v":{"$error":"#N/A"}}]
[null,"2023-11-06",null,null,null,null,null,0,0]
[null,"2023-11-07",null,null,null,null,null,0,0,null,null,{"$f":"'08'!L15","v":"Déductions"},{"$f":"'08'!M15","v":"Part"},"%"]
[null,"2023-11-08",null,null,null,null,null,0,0,null,null,{"$f":"'08'!L16","v":"Cotisations AVS, AI, APG* : "},"1/2",{"$f":"IF(B3>=DB_SoumisAVS,RS_AVS,0)","v":5.2999999999999999E-2},null,{"$f":"$Q$13*N16","v":{"$error":"#N/A"}}]
[null,"2023-11-09",null,null,null,null,null,0,0,null,null,{"$f":"'08'!L17","v":"Cotisations AC* : "},"1/2",{"$f":"IF(B3>=DB_SoumisAVS,RS_AC,0)","v":1.0999999999999999E-2},null,{"$f":"$Q$13*N17","v":{"$error":"#N/A"}}]
[null,"2023-11-10",null,null,null,null,null,0,0,null,null,{"$f":"'08'!L18","v":"Accident non profes.: "},"1/1",{"$f":"RS_ANP","v":1.6070000000000001E-2},null,{"$f":"$Q$13*N18","v":{"$error":"#N/A"}}]
[null,"2023-11-11",null,null,null,null,null,0,0,null,null,{"$f":"'08'!L19","v":"Indemnité journalière MC : "},"1/2",{"$f":"RS_MC","v":4.4000000000000003E-3},null,{"$f":"$Q$13*N19","v":{"$error":"#N/A"}}]
[null,"2023-11-12",null,null,null,null,null,0,0,null,null,{"$f":"'08'!L20","v":"Autre déduction : "}]
[null,"2023-11-13",null,null,null,null,null,0,0,null,null,{"$f":"'08'!L21","v":{"$error":"#N/A"}},null,null,null,{"$f":"IF(PN_EffMoy=0,I40,IF(Nb_Mois=12,Sa_NatureMensuelArrondi,Sa_NatureMensuelArrondi*C40/H42))","v":{"$error":"#N/A"}}]
[null,"2023-11-14",null,null,null,null,null,0,0,null,null,{"$f":"'08'!L22","v":"*) Dès le 1er janvier de l'année des 18 ans de l'apprenti(e)"}]
[null,"2023-11-15",null,null,null,null,null,0,0]
[null,"2023-11-16",null,null,null,null,null,0,0,null,null,{"$f":"'08'!L24","v":"A déduire"},null,null,null,null,{"$f":"INT((SUM(P16:P21)*20)+0.5)/20","v":{"$error":"#N/A"}}]
[null,"2023-11-17",null,null,null,null,null,0,0]
[null,"2023-11-18",null,null,null,null,null,0,0,null,null,{"$f":"'08'!L26","v":"Frais et remboursement"}]
[null,"2023-11-19",null,null,null,null,null,0,0,null,null,{"$f":"'08'!L27","v":"Frais : "}]
[null,"2023-11-20",null,null,null,null,null,0,0,null,null,{"$f":"'08'!L28","v":"Autre remboursement : "}]
[null,"2023-11-21",null,null,null,null,null,0,0]
[null,"2023-11-22",null,null,null,null,null,0,0,null,null,{"$f":"'08'!L30","v":"A ajouter"},null,null,null,null,{"$f":"SUM(P27:P28)","v":0}]
[null,"2023-11-23",null,null,null,null,null,0,0]
[null,"2023-11-24",null,null,null,null,null,0,0,null,null,{"$f":"'08'!L32","v":"Versement du mois"},null,null,null,null,{"$f":"Q13+Q30-Q24","v":{"$error":"#N/A"}}]
[null,"2023-11-25",null,null,null,null,null,0,0,null,null,null,{"$f":"'08'!M33","v":"Mois\ncourant"},{"$f":"'08'!N33","v":"Cumul mois\nprécédents"},{"$f":"'08'!O33","v":"Prévus\nannuellement"},null,{"$f":"'08'!Q33","v":"Solde\nactuel"}]
[null,"2023-11-26",null,null,null,null,null,0,0,null,null,{"$f":"'08'!L34","v":"Décompte des jours"},{"$f":"'08'!M34","v":0},{"$f":"'08'!N34","v":0},{"$f":"'08'!O34","v":0},null,{"$f":"'08'!Q34","v":0}]
[null,"2023-11-27",null,null,null,null,null,0,0,null,null,{"$f":"'08'!L35","v":"Travail :"},{"$f":"H43","v":0},0,{"$f":"NJ_Travail","v":{"$error":"#N/A"}},null,{"$f":"O35-N35-M35","v":{"$error":"#N/A"}}]
[null,"2023-11-28",null,null,null,null,null,0,0,null,null,{"$f":"'08'!L36","v":"Cours prof. :"},0,0,{"$f":"NJ_CoursProf","v":{"$error":"#N/A"}},null,{"$error":"#N/A"}]
[null,"2023-11-29",null,null,null,null,null,0,0,null,null,{"$f":"'08'!L37","v":"Cours IE :"},0,0,{"$f":"NJ_CoursIE","v":{"$error":"#N/A"}},null,{"$error":"#N/A"}]
[null,"2023-11-30",null,null,null,null,null,0,0,null,null,{"$f":"'08'!L38","v":"Armée :"},0,0,{"$f":"NJ_Bloc","v":0},null,0]
[null,null,null,null,null,null,null,0,0,null,null,{"$f":"'08'!L39","v":"Congés :"},{"$f":"H47","v":0},0,{"$f":"NJ_Conge","v":{"$error":"#N/A"}},null,{"$error":"#N/A"}]
[null,{"$f":"'08'!B40","v":"Total"},{"$f":"COUNTIF(C9:C39,\"a\")+COUNTIF(C9:C39,\"b\")+COUNTIF(C9:C39,\"c\")+COUNTIF(C9:C39,\"d\")+COUNTIF(C9:C39,\"e\")+COUNTIF(C9:C39,\"f\")+COUNTIF(C9:C39,\"g\")+COUNTIF(C9:C39,\"h\")+COUNTIF(C9:C39,\"i\")","v":0},{"$f":"SUM(D9:D39)","v":0},0,0,0,0,0,{"$f":"INT(((Sa_NatureMensuel / H42 *C40)*20)+0.5)/20","v":{"$error":"#N/A"}},null,{"$f":"'08'!L40","v":"Vacances :"},0,0,{"$f":"NJ_Vacances","v":{"$error":"#N/A"}},null,{"$error":"#N/A"}]
[null,null,null,null,null,null,null,{"$f":"B3","v":"2023-11-01"},{"$f":"'08'!I41","v":"cumul"},null,null,{"$f":"'08'!L41","v":"Accident :"},0,0,0,null,0]
[null,{"$f":"'08'!B42","v":"Décompte des jours"},{"$f":"'08'!C42","v":{"$error":"#N/A"}},{"$f":"'08'!D42","v":{"$error":"#REF!"}},{"$f":"'08'!E42","v":{"$error":"#REF!"}},{"$f":"'08'!F42","v":{"$error":"#REF!"}},{"$f":"'08'!G42","v":{"$error":"#REF!"}},30,{"$f":"SUM('10'!H42:I42)","v":92},null,null,{"$f":"'08'!L42","v":"Maladie :"},0,0,0,null,0]
[null,{"$f":"'08'!B43","v":"Jours de travail (a) :"},{"$f":"'08'!C43","v":{"$error":"#N/A"}},{"$f":"'08'!D43","v":{"$error":"#REF!"}},{"$f":"'08'!E43","v":{"$error":"#REF!"}},{"$f":"'08'!F43","v":{"$error":"#REF!"}},{"$f":"'08'!G43","v":{"$error":"#REF!"}},{"$f":"COUNTIF(C9:C39,\"a\")+COUNTIF(C9:C39,\"f\")/2","v":0},{"$f":"SUM('10'!H43:I43)","v":0}]
[null,{"$f":"'08'!B44","v":"Cours professionnels (b) :"},{"$f":"'08'!C44","v":{"$error":"#N/A"}},{"$f":"'08'!D44","v":{"$error":"#REF!"}},{"$f":"'08'!E44","v":{"$error":"#REF!"}},{"$f":"'08'!F44","v":{"$error":"#REF!"}},{"$f":"'08'!G44","v":{"$error":"#REF!"}},{"$f":"COUNTIF(C9:C39,\"b\")","v":0},{"$f":"SUM('10'!H44:I44)","v":0},null,null,{"$f":"'08'!L44","v":"Remarques : "}]
[null,{"$f":"'08'!B45","v":"Cours interentreprises (c) :"},{"$f":"'08'!C45","v":{"$error":"#N/A"}},{"$f":"'08'!D45","v":{"$error":"#REF!"}},{"$f":"'08'!E45","v":{"$error":"#REF!"}},{"$f":"'08'!F45","v":{"$error":"#REF!"}},{"$f":"'08'!G45","v":{"$error":"#REF!"}},{"$f":"COUNTIF(C9:C39,\"c\")","v":0},{"$f":"SUM('10'!H45:I45)","v":0}]
[null,{"$f":"'08'!B46","v":"Armée (i) :"},{"$f":"'08'!C46","v":{"$error":"#N/A"}},{"$f":"'08'!D46","v":{"$error":"#REF!"}},{"$f":"'08'!E46","v":{"$error":"#REF!"}},{"$f":"'08'!F46","v":{"$error":"#REF!"}},{"$f":"'08'!G46","v":{"$error":"#REF!"}},{"$f":"COUNTIF(C9:C39,\"i\")","v":0},{"$f":"SUM('10'!H46:I46)","v":0}]
[null,{"$f":"'08'!B47","v":"Congé (d) :"},{"$f":"'08'!C47","v":{"$error":"#N/A"}},{"$f":"'08'!D47","v":{"$error":"#REF!"}},{"$f":"'08'!E47","v":{"$error":"#REF!"}},{"$f":"'08'!F47","v":{"$error":"#REF!"}},{"$f":"'08'!G47","v":{"$error":"#REF!"}},{"$f":"COUNTIF(C9:C39,\"d\")+COUNTIF(C9:C39,\"f\")/2","v":0},{"$f":"SUM('10'!H47:I47)","v":0}]
[289,{"$f":"'08'!B48","v":"Vacances (e) :"},{"$f":"'08'!C48","v":{"$error":"#N/A"}},{"$f":"'08'!D48","v":{"$error":"#REF!"}},{"$f":"'08'!E48","v":{"$error":"#REF!"}},{"$f":"'08'!F48","v":{"$error":"#REF!"}},{"$f":"'08'!G48","v":{"$error":"#REF!"}},{"$f":"COUNTIF(C9:C39,\"e\")","v":0},{"$f":"SUM('10'!H48:I48)","v":0},null,null,{"$f":"'08'!L48","v":"Date :"},null,null,{"$f":"'08'!O48","v":"Maître d'apprentissage : "}]
[290,{"$f":"'08'!B49","v":"Accident (g) :"},{"$f":"'08'!C49","v":{"$error":"#N/A"}},{"$f":"'08'!D49","v":{"$error":"#REF!"}},{"$f":"'08'!E49","v":{"$error":"#REF!"}},{"$f":"'08'!F49","v":{"$error":"#REF!"}},{"$f":"'08'!G49","v":{"$error":"#REF!"}},{"$f":"COUNTIF(C9:C39,\"g\")","v":0},{"$f":"SUM('10'!H49:I49)","v":0}]
[291,{"$f":"'08'!B50","v":"Maladie (h) :"},{"$f":"'08'!C50","v":{"$error":"#N/A"}},{"$f":"'08'!D50","v":{"$error":"#REF!"}},{"$f":"'08'!E50","v":{"$error":"#REF!"}},{"$f":"'08'!F50","v":{"$error":"#REF!"}},{"$f":"'08'!G50","v":{"$error":"#REF!"}},{"$f":"COUNTIF(C9:C39,\"h\")","v":0},{"$f":"SUM('10'!H50:I50)","v":0},null,null,null,null,null,{"$f":"'08'!O50","v":"Apprenti(e) : "}]

{"sheet":"12","index":6,"n_rows":50,"n_cols":17,"rows_kept":50,"cut":false,"hidden":false,"merged":[[40,1,40,6],[41,1,41,6],[32,13,33,13],[32,12,33,12],[32,15,33,15],[32,14,33,14],[45,1,45,6],[49,1,49,6],[42,1,42,6],[46,1,46,6],[43,1,43,6],[44,1,44,6],[47,1,47,6],[48,1,48,6],[19,12,19,13],[26,12,26,13],[27,12,27,13],[6,12,6,16],[7,12,7,13],[43,12,45,16],[32,16,33,16],[2,7,7,7],[2,8,7,8],[2,5,7,5],[2,9,7,9],[4,12,4,16],[5,12,5,16],[1,2,1,9],[0,1,0,9],[0,11,0,16],[2,12,2,13],[2,14,2,15],[2,1,7,1],[2,2,7,2],[2,3,7,3],[2,4,7,4],[2,6,7,6]]}
[null,{"$f":"'08'!B1","v":"Agenda"},null,null,null,null,null,null,null,null,null,{"$f":"'08'!L1","v":"Décompte salaire mensuel"}]
[null,{"$f":"'08'!B2","v":"Apprenti(e)"},{"$f":"\"- \" & TRIM(DB_Apprenti) & \" -\"","v":"-  -"}]
[null,{"$f":"DATE(DB_Annee,12,1)","v":"2023-12-01"},{"$f":"'08'!C3","v":"[ a-b-c-d-e-f-g-h-i ]"},{"$f":"'08'!D3","v":"Logis"},{"$f":"'08'!E3","v":"Déjeuner"},{"$f":"'08'!F3","v":"Dîner"},{"$f":"'08'!G3","v":"Souper "},{"$f":"'08'!H3","v":"Montant des\n Prestations en\n nature"},{"$f":"'08'!I3","v":"Montant\n modifié"},{"$f":"'08'!J3","v":"Commentaires \na = Jour de travail\nb = Jour de cours professionel\nc = Jour de cours interentreprises\nd = Jour de congé\ne = Jour de vacances\nf = 1/2 jour de travail, 1/2 jour de congé\ng = Accident (jour entier)\nh = Maladie (jour entier)\ni = Armée"},null,{"$f":"'08'!L3","v":"Mois : "},{"$f":"B3","v":"2023-12-01"},null,{"$f":"'08'!O3","v":"Année :"},{"$f":"'08'!P3","v":0},{"$f":"B3","v":"2023-12-01"}]
[null,null,{"$f":"'08'!C4","v":0},{"$f":"'08'!D4","v":0},{"$f":"'08'!E4","v":0},{"$f":"'08'!F4","v":0},{"$f":"'08'!G4","v":0},{"$f":"'08'!H4","v":0},{"$f":"'08'!I4","v":0},{"$f":"'08'!J4","v":0}]
[null,null,{"$f":"'08'!C5","v":0},{"$f":"'08'!D5","v":0},{"$f":"'08'!E5","v":0},{"$f":"'08'!F5","v":0},{"$f":"'08'!G5","v":0},{"$f":"'08'!H5","v":0},{"$f":"'08'!I5","v":0},{"$f":"'08'!J5","v":0},null,{"$f":"'08'!L5","v":"Maître d'apprentissage : "},{"$f":"TRIM(DB_Maitre)","v":""}]
[null,null,{"$f":"'08'!C6","v":0},{"$f":"'08'!D6","v":0},{"$f":"'08'!E6","v":0},{"$f":"'08'!F6","v":0},{"$f":"'08'!G6","v":0},{"$f":"'08'!H6","v":0},{"$f":"'08'!I6","v":0},{"$f":"'08'!J6","v":0},null,{"$f":"'08'!L6","v":"Lieu : "},{"$f":"TRIM(DB_MaitreLieu)","v":""}]
[null,null,{"$f":"'08'!C7","v":0},{"$f":"'08'!D7","v":0},{"$f":"'08'!E7","v":0},{"$f":"'08'!F7","v":0},{"$f":"'08'!G7","v":0},{"$f":"'08'!H7","v":0},{"$f":"'08'!I7","v":0},{"$f":"'08'!J7","v":0},null,{"$f":"'08'!L7","v":"Apprenti : "},{"$f":"TRIM(DB_Apprenti)","v":""}]
[null,null,{"$f":"'08'!C8","v":0},{"$f":"'08'!D8","v":0},{"$f":"'08'!E8","v":0},{"$f":"'08'!F8","v":0},{"$f":"'08'!G8","v":0},{"$f":"'08'!H8","v":0},{"$f":"'08'!I8","v":0},{"$f":"'08'!J8","v":0},null,{"$f":"'08'!L8","v":"N° AVS : "},{"$f":"TRIM(DB_AVS)","v":""},null,null,{"$f":"'08'!P8","v":"Date de naissance :"},{"$f":"IF(DB_DateNaissance=0,\"\",DB_DateNaissance)","v":""}]
[null,{"$f":"B3","v":"2023-12-01"},null,null,null,null,null,{"$f":"MAX(IF(C9=\"a\",PN_Travail,IF(C9=\"b\",PN_CoursProf,IF(C9=\"c\",PN_CoursIE,IF(C9=\"d\",PN_Conge,0)))),IF(C9=\"e\",PN_Vacances,IF(C9=\"f\",PN_DemiJour,IF(C9=\"g\",PN_Accident,IF(C9=\"h\",PN_Maladie,IF(C9=\"i\",PN_Armee,0))))))","v":0},{"$f":"H9+D9*PN_Logis+E9*PN_Dejeuner+F9*PN_Diner+G9*PN_Souper","v":0}]
[null,{"$f":"B9+1","v":"2023-12-02"},null,null,null,null,null,0,{"$f":"H10+D10*PN_Logis+E10*PN_Dejeuner+F10*PN_Diner+G10*PN_Souper","v":0}]
[230,{"$f":"B10+1","v":"2023-12-03"},null,null,null,null,null,0,0,null,null,{"$f":"'08'!L11","v":"Salaire brut"},{"$f":"IF(PN_EffMoy=0,SUBSTITUTE(VLOOKUP(A11+1,Tb_Traduction,DB_Langue,FALSE),\"***\",TEXT(J40,\"0.00\")),\"\")","v":{"$error":"#N/A"}},null,null,null,{"$f":"IF(OR(PN_EffMoy=0,Nb_Mois<>12),Sa_BaseMensuelArrondi / H42 *C40,Sa_BaseMensuelArrondi)","v":{"$error":"#N/A"}}]
[null,"2023-12-04",null,null,null,null,null,0,0,null,null,{"$f":"'08'!L12","v":"Prime, bonus, gratification"}]
[null,"2023-12-05",null,null,null,null,null,0,0,null,null,{"$f":"'08'!L13","v":"Salaire brut total"},null,null,null,null,{"$f":"SUM(Q11:Q12)","v":{"$error":"#N/A"}}]
[null,"2023-12-06",null,null,null,null,null,0,0]
[null,"2023-12-07",null,null,null,null,null,0,0,null,null,{"$f":"'08'!L15","v":"Déductions"},{"$f":"'08'!M15","v":"Part"},"%"]
[null,"2023-12-08",null,null,null,null,null,0,0,null,null,{"$f":"'08'!L16","v":"Cotisations AVS, AI, APG* : "},"1/2",{"$f":"IF(B3>=DB_SoumisAVS,RS_AVS,0)","v":5.2999999999999999E-2},null,{"$f":"$Q$13*N16","v":{"$error":"#N/A"}}]
[null,"2023-12-09",null,null,null,null,null,0,0,null,null,{"$f":"'08'!L17","v":"Cotisations AC* : "},"1/2",{"$f":"IF(B3>=DB_SoumisAVS,RS_AC,0)","v":1.0999999999999999E-2},null,{"$f":"$Q$13*N17","v":{"$error":"#N/A"}}]
[null,"2023-12-10",null,null,null,null,null,0,0,null,null,{"$f":"'08'!L18","v":"Accident non profes.: "},"1/1",{"$f":"RS_ANP","v":1.6070000000000001E-2},null,{"$f":"$Q$13*N18","v":{"$error":"#N/A"}}]
[null,"2023-12-11",null,null,null,null,null,0,0,null,null,{"$f":"'08'!L19","v":"Indemnité journalière MC : "},"1/2",{"$f":"RS_MC","v":4.4000000000000003E-3},null,{"$f":"$Q$13*N19","v":{"$error":"#N/A"}}]
[null,"2023-12-12",null,null,null,null,null,0,0,null,null,{"$f":"'08'!L20","v":"Autre déduction : "}]
[null,"2023-12-13",null,null,null,null,null,0,0,null,null,{"$f":"'08'!L21","v":{"$error":"#N/A"}},null,null,null,{"$f":"IF(PN_EffMoy=0,I40,IF(Nb_Mois=12,Sa_NatureMensuelArrondi,Sa_NatureMensuelArrondi*C40/H42))","v":{"$error":"#N/A"}}]
[null,"2023-12-14",null,null,null,null,null,0,0,null,null,{"$f":"'08'!L22","v":"*) Dès le 1er janvier de l'année des 18 ans de l'apprenti(e)"}]
[null,"2023-12-15",null,null,null,null,null,0,0]
[null,"2023-12-16",null,null,null,null,null,0,0,null,null,{"$f":"'08'!L24","v":"A déduire"},null,null,null,null,{"$f":"INT((SUM(P16:P21)*20)+0.5)/20","v":{"$error":"#N/A"}}]
[null,"2023-12-17",null,null,null,null,null,0,0]
[null,"2023-12-18",null,null,null,null,null,0,0,null,null,{"$f":"'08'!L26","v":"Frais et remboursement"}]
[null,"2023-12-19",null,null,null,null,null,0,0,null,null,{"$f":"'08'!L27","v":"Frais : "}]
[null,"2023-12-20",null,null,null,null,null,0,0,null,null,{"$f":"'08'!L28","v":"Autre remboursement : "}]
[null,"2023-12-21",null,null,null,null,null,0,0]
[null,"2023-12-22",null,null,null,null,null,0,0,null,null,{"$f":"'08'!L30","v":"A ajouter"},null,null,null,null,{"$f":"SUM(P27:P28)","v":0}]
[null,"2023-12-23",null,null,null,null,null,0,0]
[null,"2023-12-24",null,null,null,null,null,0,0,null,null,{"$f":"'08'!L32","v":"Versement du mois"},null,null,null,null,{"$f":"Q13+Q30-Q24","v":{"$error":"#N/A"}}]
[null,"2023-12-25",null,null,null,null,null,0,0,null,null,null,{"$f":"'08'!M33","v":"Mois\ncourant"},{"$f":"'08'!N33","v":"Cumul mois\nprécédents"},{"$f":"'08'!O33","v":"Prévus\nannuellement"},null,{"$f":"'08'!Q33","v":"Solde\nactuel"}]
[null,"2023-12-26",null,null,null,null,null,0,0,null,null,{"$f":"'08'!L34","v":"Décompte des jours"},{"$f":"'08'!M34","v":0},{"$f":"'08'!N34","v":0},{"$f":"'08'!O34","v":0},null,{"$f":"'08'!Q34","v":0}]
[null,"2023-12-27",null,null,null,null,null,0,0,null,null,{"$f":"'08'!L35","v":"Travail :"},{"$f":"H43","v":0},0,{"$f":"NJ_Travail","v":{"$error":"#N/A"}},null,{"$f":"O35-N35-M35","v":{"$error":"#N/A"}}]
[null,"2023-12-28",null,null,null,null,null,0,0,null,null,{"$f":"'08'!L36","v":"Cours prof. :"},0,0,{"$f":"NJ_CoursProf","v":{"$error":"#N/A"}},null,{"$error":"#N/A"}]
[null,"2023-12-29",null,null,null,null,null,0,0,null,null,{"$f":"'08'!L37","v":"Cours IE :"},0,0,{"$f":"NJ_CoursIE","v":{"$error":"#N/A"}},null,{"$error":"#N/A"}]
[null,"2023-12-30",null,null,null,null,null,0,0,null,null,{"$f":"'08'!L38","v":"Armée :"},0,0,{"$f":"NJ_Bloc","v":0},null,0]
[null,"2023-12-31",null,null,null,null,null,0,0,null,null,{"$f":"'08'!L39","v":"Congés :"},{"$f":"H47","v":0},0,{"$f":"NJ_Conge","v":{"$error":"#N/A"}},null,{"$error":"#N/A"}]
[null,{"$f":"'08'!B40","v":"Total"},{"$f":"COUNTIF(C9:C39,\"a\")+COUNTIF(C9:C39,\"b\")+COUNTIF(C9:C39,\"c\")+COUNTIF(C9:C39,\"d\")+COUNTIF(C9:C39,\"e\")+COUNTIF(C9:C39,\"f\")+COUNTIF(C9:C39,\"g\")+COUNTIF(C9:C39,\"h\")+COUNTIF(C9:C39,\"i\")","v":0},{"$f":"SUM(D9:D39)","v":0},0,0,0,0,0,{"$f":"INT(((Sa_NatureMensuel / H42 *C40)*20)+0.5)/20","v":{"$error":"#N/A"}},null,{"$f":"'08'!L40","v":"Vacances :"},0,0,{"$f":"NJ_Vacances","v":{"$error":"#N/A"}},null,{"$error":"#N/A"}]
[null,null,null,null,null,null,null,{"$f":"B3","v":"2023-12-01"},{"$f":"'08'!I41","v":"cumul"},null,null,{"$f":"'08'!L41","v":"Accident :"},0,0,0,null,0]
[null,{"$f":"'08'!B42","v":"Décompte des jours"},{"$f":"'08'!C42","v":{"$error":"#N/A"}},{"$f":"'08'!D42","v":{"$error":"#REF!"}},{"$f":"'08'!E42","v":{"$error":"#REF!"}},{"$f":"'08'!F42","v":{"$error":"#REF!"}},{"$f":"'08'!G42","v":{"$error":"#REF!"}},31,{"$f":"SUM('11'!H42:I42)","v":122},null,null,{"$f":"'08'!L42","v":"Maladie :"},0,0,0,null,0]
[null,{"$f":"'08'!B43","v":"Jours de travail (a) :"},{"$f":"'08'!C43","v":{"$error":"#N/A"}},{"$f":"'08'!D43","v":{"$error":"#REF!"}},{"$f":"'08'!E43","v":{"$error":"#REF!"}},{"$f":"'08'!F43","v":{"$error":"#REF!"}},{"$f":"'08'!G43","v":{"$error":"#REF!"}},{"$f":"COUNTIF(C9:C39,\"a\")+COUNTIF(C9:C39,\"f\")/2","v":0},{"$f":"SUM('11'!H43:I43)","v":0}]
[null,{"$f":"'08'!B44","v":"Cours professionnels (b) :"},{"$f":"'08'!C44","v":{"$error":"#N/A"}},{"$f":"'08'!D44","v":{"$error":"#REF!"}},{"$f":"'08'!E44","v":{"$error":"#REF!"}},{"$f":"'08'!F44","v":{"$error":"#REF!"}},{"$f":"'08'!G44","v":{"$error":"#REF!"}},{"$f":"COUNTIF(C9:C39,\"b\")","v":0},{"$f":"SUM('11'!H44:I44)","v":0},null,null,{"$f":"'08'!L44","v":"Remarques : "}]
[null,{"$f":"'08'!B45","v":"Cours interentreprises (c) :"},{"$f":"'08'!C45","v":{"$error":"#N/A"}},{"$f":"'08'!D45","v":{"$error":"#REF!"}},{"$f":"'08'!E45","v":{"$error":"#REF!"}},{"$f":"'08'!F45","v":{"$error":"#REF!"}},{"$f":"'08'!G45","v":{"$error":"#REF!"}},{"$f":"COUNTIF(C9:C39,\"c\")","v":0},{"$f":"SUM('11'!H45:I45)","v":0}]
[null,{"$f":"'08'!B46","v":"Armée (i) :"},{"$f":"'08'!C46","v":{"$error":"#N/A"}},{"$f":"'08'!D46","v":{"$error":"#REF!"}},{"$f":"'08'!E46","v":{"$error":"#REF!"}},{"$f":"'08'!F46","v":{"$error":"#REF!"}},{"$f":"'08'!G46","v":{"$error":"#REF!"}},{"$f":"COUNTIF(C9:C39,\"i\")","v":0},{"$f":"SUM('11'!H46:I46)","v":0}]
[null,{"$f":"'08'!B47","v":"Congé (d) :"},{"$f":"'08'!C47","v":{"$error":"#N/A"}},{"$f":"'08'!D47","v":{"$error":"#REF!"}},{"$f":"'08'!E47","v":{"$error":"#REF!"}},{"$f":"'08'!F47","v":{"$error":"#REF!"}},{"$f":"'08'!G47","v":{"$error":"#REF!"}},{"$f":"COUNTIF(C9:C39,\"d\")+COUNTIF(C9:C39,\"f\")/2","v":0},{"$f":"SUM('11'!H47:I47)","v":0}]
[289,{"$f":"'08'!B48","v":"Vacances (e) :"},{"$f":"'08'!C48","v":{"$error":"#N/A"}},{"$f":"'08'!D48","v":{"$error":"#REF!"}},{"$f":"'08'!E48","v":{"$error":"#REF!"}},{"$f":"'08'!F48","v":{"$error":"#REF!"}},{"$f":"'08'!G48","v":{"$error":"#REF!"}},{"$f":"COUNTIF(C9:C39,\"e\")","v":0},{"$f":"SUM('11'!H48:I48)","v":0},null,null,{"$f":"'08'!L48","v":"Date :"},null,null,{"$f":"'08'!O48","v":"Maître d'apprentissage : "}]
[290,{"$f":"'08'!B49","v":"Accident (g) :"},{"$f":"'08'!C49","v":{"$error":"#N/A"}},{"$f":"'08'!D49","v":{"$error":"#REF!"}},{"$f":"'08'!E49","v":{"$error":"#REF!"}},{"$f":"'08'!F49","v":{"$error":"#REF!"}},{"$f":"'08'!G49","v":{"$error":"#REF!"}},{"$f":"COUNTIF(C9:C39,\"g\")","v":0},{"$f":"SUM('11'!H49:I49)","v":0}]
[291,{"$f":"'08'!B50","v":"Maladie (h) :"},{"$f":"'08'!C50","v":{"$error":"#N/A"}},{"$f":"'08'!D50","v":{"$error":"#REF!"}},{"$f":"'08'!E50","v":{"$error":"#REF!"}},{"$f":"'08'!F50","v":{"$error":"#REF!"}},{"$f":"'08'!G50","v":{"$error":"#REF!"}},{"$f":"COUNTIF(C9:C39,\"h\")","v":0},{"$f":"SUM('11'!H50:I50)","v":0},null,null,null,null,null,{"$f":"'08'!O50","v":"Apprenti(e) : "}]

{"sheet":"01","index":7,"n_rows":50,"n_cols":17,"rows_kept":50,"cut":false,"hidden":false,"merged":[[40,1,40,6],[41,1,41,6],[32,13,33,13],[32,12,33,12],[32,15,33,15],[32,14,33,14],[45,1,45,6],[49,1,49,6],[42,1,42,6],[46,1,46,6],[43,1,43,6],[44,1,44,6],[47,1,47,6],[48,1,48,6],[19,12,19,13],[26,12,26,13],[27,12,27,13],[6,12,6,16],[7,12,7,13],[43,12,45,16],[32,16,33,16],[2,7,7,7],[2,8,7,8],[2,5,7,5],[2,9,7,9],[4,12,4,16],[5,12,5,16],[1,2,1,9],[0,1,0,9],[0,11,0,16],[2,12,2,13],[2,14,2,15],[2,1,7,1],[2,2,7,2],[2,3,7,3],[2,4,7,4],[2,6,7,6]]}
[null,{"$f":"'08'!B1","v":"Agenda"},null,null,null,null,null,null,null,null,null,{"$f":"'08'!L1","v":"Décompte salaire mensuel"}]
[null,{"$f":"'08'!B2","v":"Apprenti(e)"},{"$f":"\"- \" & TRIM(DB_Apprenti) & \" -\"","v":"-  -"}]
[null,{"$f":"DATE(DB_Annee+1,1,1)","v":"2024-01-01"},{"$f":"'08'!C3","v":"[ a-b-c-d-e-f-g-h-i ]"},{"$f":"'08'!D3","v":"Logis"},{"$f":"'08'!E3","v":"Déjeuner"},{"$f":"'08'!F3","v":"Dîner"},{"$f":"'08'!G3","v":"Souper "},{"$f":"'08'!H3","v":"Montant des\n Prestations en\n nature"},{"$f":"'08'!I3","v":"Montant\n modifié"},{"$f":"'08'!J3","v":"Commentaires \na = Jour de travail\nb = Jour de cours professionel\nc = Jour de cours interentreprises\nd = Jour de congé\ne = Jour de vacances\nf = 1/2 jour de travail, 1/2 jour de congé\ng = Accident (jour entier)\nh = Maladie (jour entier)\ni = Armée"},null,{"$f":"'08'!L3","v":"Mois : "},{"$f":"B3","v":"2024-01-01"},null,{"$f":"'08'!O3","v":"Année :"},{"$f":"'08'!P3","v":0},{"$f":"B3","v":"2024-01-01"}]
[null,null,{"$f":"'08'!C4","v":0},{"$f":"'08'!D4","v":0},{"$f":"'08'!E4","v":0},{"$f":"'08'!F4","v":0},{"$f":"'08'!G4","v":0},{"$f":"'08'!H4","v":0},{"$f":"'08'!I4","v":0},{"$f":"'08'!J4","v":0}]
[null,null,{"$f":"'08'!C5","v":0},{"$f":"'08'!D5","v":0},{"$f":"'08'!E5","v":0},{"$f":"'08'!F5","v":0},{"$f":"'08'!G5","v":0},{"$f":"'08'!H5","v":0},{"$f":"'08'!I5","v":0},{"$f":"'08'!J5","v":0},null,{"$f":"'08'!L5","v":"Maître d'apprentissage : "},{"$f":"TRIM(DB_Maitre)","v":""}]
[null,null,{"$f":"'08'!C6","v":0},{"$f":"'08'!D6","v":0},{"$f":"'08'!E6","v":0},{"$f":"'08'!F6","v":0},{"$f":"'08'!G6","v":0},{"$f":"'08'!H6","v":0},{"$f":"'08'!I6","v":0},{"$f":"'08'!J6","v":0},null,{"$f":"'08'!L6","v":"Lieu : "},{"$f":"TRIM(DB_MaitreLieu)","v":""}]
[null,null,{"$f":"'08'!C7","v":0},{"$f":"'08'!D7","v":0},{"$f":"'08'!E7","v":0},{"$f":"'08'!F7","v":0},{"$f":"'08'!G7","v":0},{"$f":"'08'!H7","v":0},{"$f":"'08'!I7","v":0},{"$f":"'08'!J7","v":0},null,{"$f":"'08'!L7","v":"Apprenti : "},{"$f":"TRIM(DB_Apprenti)","v":""}]
[null,null,{"$f":"'08'!C8","v":0},{"$f":"'08'!D8","v":0},{"$f":"'08'!E8","v":0},{"$f":"'08'!F8","v":0},{"$f":"'08'!G8","v":0},{"$f":"'08'!H8","v":0},{"$f":"'08'!I8","v":0},{"$f":"'08'!J8","v":0},null,{"$f":"'08'!L8","v":"N° AVS : "},{"$f":"TRIM(DB_AVS)","v":""},null,null,{"$f":"'08'!P8","v":"Date de naissance :"},{"$f":"IF(DB_DateNaissance=0,\"\",DB_DateNaissance)","v":""}]
[null,{"$f":"B3","v":"2024-01-01"},null,null,null,null,null,{"$f":"MAX(IF(C9=\"a\",PN_Travail,IF(C9=\"b\",PN_CoursProf,IF(C9=\"c\",PN_CoursIE,IF(C9=\"d\",PN_Conge,0)))),IF(C9=\"e\",PN_Vacances,IF(C9=\"f\",PN_DemiJour,IF(C9=\"g\",PN_Accident,IF(C9=\"h\",PN_Maladie,IF(C9=\"i\",PN_Armee,0))))))","v":0},{"$f":"H9+D9*PN_Logis_Plus+E9*PN_Dejeuner_Plus+F9*PN_Diner_Plus+G9*PN_Souper_Plus","v":0}]
[null,{"$f":"B9+1","v":"2024-01-02"},null,null,null,null,null,0,0]
[230,{"$f":"B10+1","v":"2024-01-03"},null,null,null,null,null,0,0,null,null,{"$f":"'08'!L11","v":"Salaire brut"},{"$f":"IF(PN_EffMoy=0,SUBSTITUTE(VLOOKUP(A11+1,Tb_Traduction,DB_Langue,FALSE),\"***\",TEXT(J40,\"0.00\")),\"\")","v":{"$error":"#N/A"}},null,null,null,{"$f":"IF(OR(PN_EffMoy=0,Nb_Mois<>12),Sa_BaseMensuelArrondi / H42 *C40,Sa_BaseMensuelArrondi)","v":{"$error":"#N/A"}}]
[null,"2024-01-04",null,null,null,null,null,0,0,null,null,{"$f":"'08'!L12","v":"Prime, bonus, gratification"}]
[null,"2024-01-05",null,null,null,null,null,0,0,null,null,{"$f":"'08'!L13","v":"Salaire brut total"},null,null,null,null,{"$f":"SUM(Q11:Q12)","v":{"$error":"#N/A"}}]
[null,"2024-01-06",null,null,null,null,null,0,0]
[null,"2024-01-07",null,null,null,null,null,0,0,null,null,{"$f":"'08'!L15","v":"Déductions"},{"$f":"'08'!M15","v":"Part"},"%"]
[null,"2024-01-08",null,null,null,null,null,0,0,null,null,{"$f":"'08'!L16","v":"Cotisations AVS, AI, APG* : "},"1/2",{"$f":"IF(B3>=DB_SoumisAVS,RS_AVS_Plus,0)","v":5.2999999999999999E-2},null,{"$f":"$Q$13*N16","v":{"$error":"#N/A"}}]
[null,"2024-01-09",null,null,null,null,null,0,0,null,null,{"$f":"'08'!L17","v":"Cotisations AC* : "},"1/2",{"$f":"IF(B3>=DB_SoumisAVS,RS_AC_Plus,0)","v":1.0999999999999999E-2},null,{"$f":"$Q$13*N17","v":{"$error":"#N/A"}}]
[null,"2024-01-10",null,null,null,null,null,0,0,null,null,{"$f":"'08'!L18","v":"Accident non profes.: "},"1/1",{"$f":"RS_ANP_Plus","v":1.6070000000000001E-2},null,{"$f":"$Q$13*N18","v":{"$error":"#N/A"}}]
[null,"2024-01-11",null,null,null,null,null,0,0,null,null,{"$f":"'08'!L19","v":"Indemnité journalière MC : "},"1/2",{"$f":"RS_MC_Plus","v":4.4000000000000003E-3},null,{"$f":"$Q$13*N19","v":{"$error":"#N/A"}}]
[null,"2024-01-12",null,null,null,null,null,0,0,null,null,{"$f":"'08'!L20","v":"Autre déduction : "}]
[null,"2024-01-13",null,null,null,null,null,0,0,null,null,{"$f":"'08'!L21","v":{"$error":"#N/A"}},null,null,null,{"$f":"IF(PN_EffMoy=0,I40,IF(Nb_Mois=12,Sa_NatureMensuelArrondi,Sa_NatureMensuelArrondi*C40/H42))","v":{"$error":"#N/A"}}]
[null,"2024-01-14",null,null,null,null,null,0,0,null,null,{"$f":"'08'!L22","v":"*) Dès le 1er janvier de l'année des 18 ans de l'apprenti(e)"}]
[null,"2024-01-15",null,null,null,null,null,0,0]
[null,"2024-01-16",null,null,null,null,null,0,0,null,null,{"$f":"'08'!L24","v":"A déduire"},null,null,null,null,{"$f":"INT((SUM(P16:P21)*20)+0.5)/20","v":{"$error":"#N/A"}}]
[null,"2024-01-17",null,null,null,null,null,0,0]
[null,"2024-01-18",null,null,null,null,null,0,0,null,null,{"$f":"'08'!L26","v":"Frais et remboursement"}]
[null,"2024-01-19",null,null,null,null,null,0,0,null,null,{"$f":"'08'!L27","v":"Frais : "}]
[null,"2024-01-20",null,null,null,null,null,0,0,null,null,{"$f":"'08'!L28","v":"Autre remboursement : "}]
[null,"2024-01-21",null,null,null,null,null,0,0]
[null,"2024-01-22",null,null,null,null,null,0,0,null,null,{"$f":"'08'!L30","v":"A ajouter"},null,null,null,null,{"$f":"SUM(P27:P28)","v":0}]
[null,"2024-01-23",null,null,null,null,null,0,0]
[null,"2024-01-24",null,null,null,null,null,0,0,null,null,{"$f":"'08'!L32","v":"Versement du mois"},null,null,null,null,{"$f":"Q13+Q30-Q24","v":{"$error":"#N/A"}}]
[null,"2024-01-25",null,null,null,null,null,0,0,null,null,null,{"$f":"'08'!M33","v":"Mois\ncourant"},{"$f":"'08'!N33","v":"Cumul mois\nprécédents"},{"$f":"'08'!O33","v":"Prévus\nannuellement"},null,{"$f":"'08'!Q33","v":"Solde\nactuel"}]
[null,"2024-01-26",null,null,null,null,null,0,0,null,null,{"$f":"'08'!L34","v":"Décompte des jours"},{"$f":"'08'!M34","v":0},{"$f":"'08'!N34","v":0},{"$f":"'08'!O34","v":0},null,{"$f":"'08'!Q34","v":0}]
[null,"2024-01-27",null,null,null,null,null,0,0,null,null,{"$f":"'08'!L35","v":"Travail :"},{"$f":"H43","v":0},0,{"$f":"NJ_Travail","v":{"$error":"#N/A"}},null,{"$f":"O35-N35-M35","v":{"$error":"#N/A"}}]
[null,"2024-01-28",null,null,null,null,null,0,0,null,null,{"$f":"'08'!L36","v":"Cours prof. :"},0,0,{"$f":"NJ_CoursProf","v":{"$error":"#N/A"}},null,{"$error":"#N/A"}]
[null,"2024-01-29",null,null,null,null,null,0,0,null,null,{"$f":"'08'!L37","v":"Cours IE :"},0,0,{"$f":"NJ_CoursIE","v":{"$error":"#N/A"}},null,{"$error":"#N/A"}]
[null,"2024-01-30",null,null,null,null,null,0,0,null,null,{"$f":"'08'!L38","v":"Armée :"},0,0,{"$f":"NJ_Bloc","v":0},null,0]
[null,"2024-01-31",null,null,null,null,null,0,0,null,null,{"$f":"'08'!L39","v":"Congés :"},{"$f":"H47","v":0},0,{"$f":"NJ_Conge","v":{"$error":"#N/A"}},null,{"$error":"#N/A"}]
[null,{"$f":"'08'!B40","v":"Total"},{"$f":"COUNTIF(C9:C39,\"a\")+COUNTIF(C9:C39,\"b\")+COUNTIF(C9:C39,\"c\")+COUNTIF(C9:C39,\"d\")+COUNTIF(C9:C39,\"e\")+COUNTIF(C9:C39,\"f\")+COUNTIF(C9:C39,\"g\")+COUNTIF(C9:C39,\"h\")+COUNTIF(C9:C39,\"i\")","v":0},{"$f":"SUM(D9:D39)","v":0},0,0,0,0,0,{"$f":"INT(((Sa_NatureMensuel / H42 *C40)*20)+0.5)/20","v":{"$error":"#N/A"}},null,{"$f":"'08'!L40","v":"Vacances :"},0,0,{"$f":"NJ_Vacances","v":{"$error":"#N/A"}},null,{"$error":"#N/A"}]
[null,null,null,null,null,null,null,{"$f":"B3","v":"2024-01-01"},{"$f":"'08'!I41","v":"cumul"},null,null,{"$f":"'08'!L41","v":"Accident :"},0,0,0,null,0]
[null,{"$f":"'08'!B42","v":"Décompte des jours"},{"$f":"'08'!C42","v":{"$error":"#N/A"}},{"$f":"'08'!D42","v":{"$error":"#REF!"}},{"$f":"'08'!E42","v":{"$error":"#REF!"}},{"$f":"'08'!F42","v":{"$error":"#REF!"}},{"$f":"'08'!G42","v":{"$error":"#REF!"}},31,{"$f":"SUM('12'!H42:I42)","v":153},null,null,{"$f":"'08'!L42","v":"Maladie :"},0,0,0,null,0]
[null,{"$f":"'08'!B43","v":"Jours de travail (a) :"},{"$f":"'08'!C43","v":{"$error":"#N/A"}},{"$f":"'08'!D43","v":{"$error":"#REF!"}},{"$f":"'08'!E43","v":{"$error":"#REF!"}},{"$f":"'08'!F43","v":{"$error":"#REF!"}},{"$f":"'08'!G43","v":{"$error":"#REF!"}},{"$f":"COUNTIF(C9:C39,\"a\")+COUNTIF(C9:C39,\"f\")/2","v":0},{"$f":"SUM('12'!H43:I43)","v":0}]
[null,{"$f":"'08'!B44","v":"Cours professionnels (b) :"},{"$f":"'08'!C44","v":{"$error":"#N/A"}},{"$f":"'08'!D44","v":{"$error":"#REF!"}},{"$f":"'08'!E44","v":{"$error":"#REF!"}},{"$f":"'08'!F44","v":{"$error":"#REF!"}},{"$f":"'08'!G44","v":{"$error":"#REF!"}},{"$f":"COUNTIF(C9:C39,\"b\")","v":0},{"$f":"SUM('12'!H44:I44)","v":0},null,null,{"$f":"'08'!L44","v":"Remarques : "}]
[null,{"$f":"'08'!B45","v":"Cours interentreprises (c) :"},{"$f":"'08'!C45","v":{"$error":"#N/A"}},{"$f":"'08'!D45","v":{"$error":"#REF!"}},{"$f":"'08'!E45","v":{"$error":"#REF!"}},{"$f":"'08'!F45","v":{"$error":"#REF!"}},{"$f":"'08'!G45","v":{"$error":"#REF!"}},{"$f":"COUNTIF(C9:C39,\"c\")","v":0},{"$f":"SUM('12'!H45:I45)","v":0}]
[null,{"$f":"'08'!B46","v":"Armée (i) :"},{"$f":"'08'!C46","v":{"$error":"#N/A"}},{"$f":"'08'!D46","v":{"$error":"#REF!"}},{"$f":"'08'!E46","v":{"$error":"#REF!"}},{"$f":"'08'!F46","v":{"$error":"#REF!"}},{"$f":"'08'!G46","v":{"$error":"#REF!"}},{"$f":"COUNTIF(C9:C39,\"i\")","v":0},{"$f":"SUM('12'!H46:I46)","v":0}]
[null,{"$f":"'08'!B47","v":"Congé (d) :"},{"$f":"'08'!C47","v":{"$error":"#N/A"}},{"$f":"'08'!D47","v":{"$error":"#REF!"}},{"$f":"'08'!E47","v":{"$error":"#REF!"}},{"$f":"'08'!F47","v":{"$error":"#REF!"}},{"$f":"'08'!G47","v":{"$error":"#REF!"}},{"$f":"COUNTIF(C9:C39,\"d\")+COUNTIF(C9:C39,\"f\")/2","v":0},{"$f":"SUM('12'!H47:I47)","v":0}]
[289,{"$f":"'08'!B48","v":"Vacances (e) :"},{"$f":"'08'!C48","v":{"$error":"#N/A"}},{"$f":"'08'!D48","v":{"$error":"#REF!"}},{"$f":"'08'!E48","v":{"$error":"#REF!"}},{"$f":"'08'!F48","v":{"$error":"#REF!"}},{"$f":"'08'!G48","v":{"$error":"#REF!"}},{"$f":"COUNTIF(C9:C39,\"e\")","v":0},{"$f":"SUM('12'!H48:I48)","v":0},null,null,{"$f":"'08'!L48","v":"Date :"},null,null,{"$f":"'08'!O48","v":"Maître d'apprentissage : "}]
[290,{"$f":"'08'!B49","v":"Accident (g) :"},{"$f":"'08'!C49","v":{"$error":"#N/A"}},{"$f":"'08'!D49","v":{"$error":"#REF!"}},{"$f":"'08'!E49","v":{"$error":"#REF!"}},{"$f":"'08'!F49","v":{"$error":"#REF!"}},{"$f":"'08'!G49","v":{"$error":"#REF!"}},{"$f":"COUNTIF(C9:C39,\"g\")","v":0},{"$f":"SUM('12'!H49:I49)","v":0}]
[291,{"$f":"'08'!B50","v":"Maladie (h) :"},{"$f":"'08'!C50","v":{"$error":"#N/A"}},{"$f":"'08'!D50","v":{"$error":"#REF!"}},{"$f":"'08'!E50","v":{"$error":"#REF!"}},{"$f":"'08'!F50","v":{"$error":"#REF!"}},{"$f":"'08'!G50","v":{"$error":"#REF!"}},{"$f":"COUNTIF(C9:C39,\"h\")","v":0},{"$f":"SUM('12'!H50:I50)","v":0},null,null,null,null,null,{"$f":"'08'!O50","v":"Apprenti(e) : "}]

{"sheet":"02","index":8,"n_rows":50,"n_cols":17,"rows_kept":50,"cut":false,"hidden":false,"merged":[[40,1,40,6],[41,1,41,6],[32,13,33,13],[32,12,33,12],[32,15,33,15],[32,14,33,14],[45,1,45,6],[49,1,49,6],[42,1,42,6],[46,1,46,6],[43,1,43,6],[44,1,44,6],[47,1,47,6],[48,1,48,6],[19,12,19,13],[26,12,26,13],[27,12,27,13],[6,12,6,16],[7,12,7,13],[43,12,45,16],[32,16,33,16],[2,7,7,7],[2,8,7,8],[2,5,7,5],[2,9,7,9],[4,12,4,16],[5,12,5,16],[1,2,1,9],[0,1,0,9],[0,11,0,16],[2,12,2,13],[2,14,2,15],[2,1,7,1],[2,2,7,2],[2,3,7,3],[2,4,7,4],[2,6,7,6]]}
[null,{"$f":"'08'!B1","v":"Agenda"},null,null,null,null,null,null,null,null,null,{"$f":"'08'!L1","v":"Décompte salaire mensuel"}]
[null,{"$f":"'08'!B2","v":"Apprenti(e)"},{"$f":"\"- \" & TRIM(DB_Apprenti) & \" -\"","v":"-  -"}]
[null,{"$f":"DATE(DB_Annee+1,2,1)","v":"2024-02-01"},{"$f":"'08'!C3","v":"[ a-b-c-d-e-f-g-h-i ]"},{"$f":"'08'!D3","v":"Logis"},{"$f":"'08'!E3","v":"Déjeuner"},{"$f":"'08'!F3","v":"Dîner"},{"$f":"'08'!G3","v":"Souper "},{"$f":"'08'!H3","v":"Montant des\n Prestations en\n nature"},{"$f":"'08'!I3","v":"Montant\n modifié"},{"$f":"'08'!J3","v":"Commentaires \na = Jour de travail\nb = Jour de cours professionel\nc = Jour de cours interentreprises\nd = Jour de congé\ne = Jour de vacances\nf = 1/2 jour de travail, 1/2 jour de congé\ng = Accident (jour entier)\nh = Maladie (jour entier)\ni = Armée"},null,{"$f":"'08'!L3","v":"Mois : "},{"$f":"B3","v":"2024-02-01"},null,{"$f":"'08'!O3","v":"Année :"},{"$f":"'08'!P3","v":0},{"$f":"B3","v":"2024-02-01"}]
[null,null,{"$f":"'08'!C4","v":0},{"$f":"'08'!D4","v":0},{"$f":"'08'!E4","v":0},{"$f":"'08'!F4","v":0},{"$f":"'08'!G4","v":0},{"$f":"'08'!H4","v":0},{"$f":"'08'!I4","v":0},{"$f":"'08'!J4","v":0}]
[null,null,{"$f":"'08'!C5","v":0},{"$f":"'08'!D5","v":0},{"$f":"'08'!E5","v":0},{"$f":"'08'!F5","v":0},{"$f":"'08'!G5","v":0},{"$f":"'08'!H5","v":0},{"$f":"'08'!I5","v":0},{"$f":"'08'!J5","v":0},null,{"$f":"'08'!L5","v":"Maître d'apprentissage : "},{"$f":"TRIM(DB_Maitre)","v":""}]
[null,null,{"$f":"'08'!C6","v":0},{"$f":"'08'!D6","v":0},{"$f":"'08'!E6","v":0},{"$f":"'08'!F6","v":0},{"$f":"'08'!G6","v":0},{"$f":"'08'!H6","v":0},{"$f":"'08'!I6","v":0},{"$f":"'08'!J6","v":0},null,{"$f":"'08'!L6","v":"Lieu : "},{"$f":"TRIM(DB_MaitreLieu)","v":""}]
[null,null,{"$f":"'08'!C7","v":0},{"$f":"'08'!D7","v":0},{"$f":"'08'!E7","v":0},{"$f":"'08'!F7","v":0},{"$f":"'08'!G7","v":0},{"$f":"'08'!H7","v":0},{"$f":"'08'!I7","v":0},{"$f":"'08'!J7","v":0},null,{"$f":"'08'!L7","v":"Apprenti : "},{"$f":"TRIM(DB_Apprenti)","v":""}]
[null,null,{"$f":"'08'!C8","v":0},{"$f":"'08'!D8","v":0},{"$f":"'08'!E8","v":0},{"$f":"'08'!F8","v":0},{"$f":"'08'!G8","v":0},{"$f":"'08'!H8","v":0},{"$f":"'08'!I8","v":0},{"$f":"'08'!J8","v":0},null,{"$f":"'08'!L8","v":"N° AVS : "},{"$f":"TRIM(DB_AVS)","v":""},null,null,{"$f":"'08'!P8","v":"Date de naissance :"},{"$f":"IF(DB_DateNaissance=0,\"\",DB_DateNaissance)","v":""}]
[null,{"$f":"B3","v":"2024-02-01"},null,null,null,null,null,{"$f":"MAX(IF(C9=\"a\",PN_Travail,IF(C9=\"b\",PN_CoursProf,IF(C9=\"c\",PN_CoursIE,IF(C9=\"d\",PN_Conge,0)))),IF(C9=\"e\",PN_Vacances,IF(C9=\"f\",PN_DemiJour,IF(C9=\"g\",PN_Accident,IF(C9=\"h\",PN_Maladie,IF(C9=\"i\",PN_Armee,0))))))","v":0},{"$f":"H9+D9*PN_Logis_Plus+E9*PN_Dejeuner_Plus+F9*PN_Diner_Plus+G9*PN_Souper_Plus","v":0}]
[null,{"$f":"B9+1","v":"2024-02-02"},null,null,null,null,null,0,0]
[230,{"$f":"B10+1","v":"2024-02-03"},null,null,null,null,null,0,0,null,null,{"$f":"'08'!L11","v":"Salaire brut"},{"$f":"IF(PN_EffMoy=0,SUBSTITUTE(VLOOKUP(A11+1,Tb_Traduction,DB_Langue,FALSE),\"***\",TEXT(J40,\"0.00\")),\"\")","v":{"$error":"#N/A"}},null,null,null,{"$f":"IF(OR(PN_EffMoy=0,Nb_Mois<>12),Sa_BaseMensuelArrondi / H42 *C40,Sa_BaseMensuelArrondi)","v":{"$error":"#N/A"}}]
[null,"2024-02-04",null,null,null,null,null,0,0,null,null,{"$f":"'08'!L12","v":"Prime, bonus, gratification"}]
[null,"2024-02-05",null,null,null,null,null,0,0,null,null,{"$f":"'08'!L13","v":"Salaire brut total"},null,null,null,null,{"$f":"SUM(Q11:Q12)","v":{"$error":"#N/A"}}]
[null,"2024-02-06",null,null,null,null,null,0,0]
[null,"2024-02-07",null,null,null,null,null,0,0,null,null,{"$f":"'08'!L15","v":"Déductions"},{"$f":"'08'!M15","v":"Part"},"%"]
[null,"2024-02-08",null,null,null,null,null,0,0,null,null,{"$f":"'08'!L16","v":"Cotisations AVS, AI, APG* : "},"1/2",{"$f":"IF(B3>=DB_SoumisAVS,RS_AVS_Plus,0)","v":5.2999999999999999E-2},null,{"$f":"$Q$13*N16","v":{"$error":"#N/A"}}]
[null,"2024-02-09",null,null,null,null,null,0,0,null,null,{"$f":"'08'!L17","v":"Cotisations AC* : "},"1/2",{"$f":"IF(B3>=DB_SoumisAVS,RS_AC_Plus,0)","v":1.0999999999999999E-2},null,{"$f":"$Q$13*N17","v":{"$error":"#N/A"}}]
[null,"2024-02-10",null,null,null,null,null,0,0,null,null,{"$f":"'08'!L18","v":"Accident non profes.: "},"1/1",{"$f":"RS_ANP_Plus","v":1.6070000000000001E-2},null,{"$f":"$Q$13*N18","v":{"$error":"#N/A"}}]
[null,"2024-02-11",null,null,null,null,null,0,0,null,null,{"$f":"'08'!L19","v":"Indemnité journalière MC : "},"1/2",{"$f":"RS_MC_Plus","v":4.4000000000000003E-3},null,{"$f":"$Q$13*N19","v":{"$error":"#N/A"}}]
[null,"2024-02-12",null,null,null,null,null,0,0,null,null,{"$f":"'08'!L20","v":"Autre déduction : "}]
[null,"2024-02-13",null,null,null,null,null,0,0,null,null,{"$f":"'08'!L21","v":{"$error":"#N/A"}},null,null,null,{"$f":"IF(PN_EffMoy=0,I40,IF(Nb_Mois=12,Sa_NatureMensuelArrondi,Sa_NatureMensuelArrondi*C40/H42))","v":{"$error":"#N/A"}}]
[null,"2024-02-14",null,null,null,null,null,0,0,null,null,{"$f":"'08'!L22","v":"*) Dès le 1er janvier de l'année des 18 ans de l'apprenti(e)"}]
[null,"2024-02-15",null,null,null,null,null,0,0]
[null,"2024-02-16",null,null,null,null,null,0,0,null,null,{"$f":"'08'!L24","v":"A déduire"},null,null,null,null,{"$f":"INT((SUM(P16:P21)*20)+0.5)/20","v":{"$error":"#N/A"}}]
[null,"2024-02-17",null,null,null,null,null,0,0]
[null,"2024-02-18",null,null,null,null,null,0,0,null,null,{"$f":"'08'!L26","v":"Frais et remboursement"}]
[null,"2024-02-19",null,null,null,null,null,0,0,null,null,{"$f":"'08'!L27","v":"Frais : "}]
[null,"2024-02-20",null,null,null,null,null,0,0,null,null,{"$f":"'08'!L28","v":"Autre remboursement : "}]
[null,"2024-02-21",null,null,null,null,null,0,0]
[null,"2024-02-22",null,null,null,null,null,0,0,null,null,{"$f":"'08'!L30","v":"A ajouter"},null,null,null,null,{"$f":"SUM(P27:P28)","v":0}]
[null,"2024-02-23",null,null,null,null,null,0,0]
[null,"2024-02-24",null,null,null,null,null,0,0,null,null,{"$f":"'08'!L32","v":"Versement du mois"},null,null,null,null,{"$f":"Q13+Q30-Q24","v":{"$error":"#N/A"}}]
[null,"2024-02-25",null,null,null,null,null,0,0,null,null,null,{"$f":"'08'!M33","v":"Mois\ncourant"},{"$f":"'08'!N33","v":"Cumul mois\nprécédents"},{"$f":"'08'!O33","v":"Prévus\nannuellement"},null,{"$f":"'08'!Q33","v":"Solde\nactuel"}]
[null,"2024-02-26",null,null,null,null,null,0,0,null,null,{"$f":"'08'!L34","v":"Décompte des jours"},{"$f":"'08'!M34","v":0},{"$f":"'08'!N34","v":0},{"$f":"'08'!O34","v":0},null,{"$f":"'08'!Q34","v":0}]
[null,"2024-02-27",null,null,null,null,null,0,0,null,null,{"$f":"'08'!L35","v":"Travail :"},{"$f":"H43","v":0},0,{"$f":"NJ_Travail","v":{"$error":"#N/A"}},null,{"$f":"O35-N35-M35","v":{"$error":"#N/A"}}]
[null,"2024-02-28",null,null,null,null,null,0,0,null,null,{"$f":"'08'!L36","v":"Cours prof. :"},0,0,{"$f":"NJ_CoursProf","v":{"$error":"#N/A"}},null,{"$error":"#N/A"}]
[null,{"$f":"B36+1","v":"2024-02-29"},null,null,null,null,null,0,{"$f":"H37+D37*PN_Logis_Plus+E37*PN_Dejeuner_Plus+F37*PN_Diner_Plus+G37*PN_Souper_Plus","v":0},null,null,{"$f":"'08'!L37","v":"Cours IE :"},0,0,{"$f":"NJ_CoursIE","v":{"$error":"#N/A"}},null,{"$error":"#N/A"}]
[null,null,null,null,null,null,null,0,0,null,null,{"$f":"'08'!L38","v":"Armée :"},0,0,{"$f":"NJ_Bloc","v":0},null,0]
[null,null,null,null,null,null,null,0,0,null,null,{"$f":"'08'!L39","v":"Congés :"},{"$f":"H47","v":0},0,{"$f":"NJ_Conge","v":{"$error":"#N/A"}},null,{"$error":"#N/A"}]
[null,{"$f":"'08'!B40","v":"Total"},{"$f":"COUNTIF(C9:C39,\"a\")+COUNTIF(C9:C39,\"b\")+COUNTIF(C9:C39,\"c\")+COUNTIF(C9:C39,\"d\")+COUNTIF(C9:C39,\"e\")+COUNTIF(C9:C39,\"f\")+COUNTIF(C9:C39,\"g\")+COUNTIF(C9:C39,\"h\")+COUNTIF(C9:C39,\"i\")","v":0},{"$f":"SUM(D9:D39)","v":0},0,0,0,0,0,{"$f":"INT(((Sa_NatureMensuel / H42 *C40)*20)+0.5)/20","v":{"$error":"#N/A"}},null,{"$f":"'08'!L40","v":"Vacances :"},0,0,{"$f":"NJ_Vacances","v":{"$error":"#N/A"}},null,{"$error":"#N/A"}]
[null,null,null,null,null,null,null,{"$f":"B3","v":"2024-02-01"},{"$f":"'08'!I41","v":"cumul"},null,null,{"$f":"'08'!L41","v":"Accident :"},0,0,0,null,0]
[null,{"$f":"'08'!B42","v":"Décompte des jours"},{"$f":"'08'!C42","v":{"$error":"#N/A"}},{"$f":"'08'!D42","v":{"$error":"#REF!"}},{"$f":"'08'!E42","v":{"$error":"#REF!"}},{"$f":"'08'!F42","v":{"$error":"#REF!"}},{"$f":"'08'!G42","v":{"$error":"#REF!"}},{"$f":"IF(MOD(YEAR(B3),4)=0,29,28)","v":29},{"$f":"SUM('01'!H42:I42)","v":184},null,null,{"$f":"'08'!L42","v":"Maladie :"},0,0,0,null,0]
[null,{"$f":"'08'!B43","v":"Jours de travail (a) :"},{"$f":"'08'!C43","v":{"$error":"#N/A"}},{"$f":"'08'!D43","v":{"$error":"#REF!"}},{"$f":"'08'!E43","v":{"$error":"#REF!"}},{"$f":"'08'!F43","v":{"$error":"#REF!"}},{"$f":"'08'!G43","v":{"$error":"#REF!"}},{"$f":"COUNTIF(C9:C39,\"a\")+COUNTIF(C9:C39,\"f\")/2","v":0},{"$f":"SUM('01'!H43:I43)","v":0}]
[null,{"$f":"'08'!B44","v":"Cours professionnels (b) :"},{"$f":"'08'!C44","v":{"$error":"#N/A"}},{"$f":"'08'!D44","v":{"$error":"#REF!"}},{"$f":"'08'!E44","v":{"$error":"#REF!"}},{"$f":"'08'!F44","v":{"$error":"#REF!"}},{"$f":"'08'!G44","v":{"$error":"#REF!"}},{"$f":"COUNTIF(C9:C39,\"b\")","v":0},{"$f":"SUM('01'!H44:I44)","v":0},null,null,{"$f":"'08'!L44","v":"Remarques : "}]
[null,{"$f":"'08'!B45","v":"Cours interentreprises (c) :"},{"$f":"'08'!C45","v":{"$error":"#N/A"}},{"$f":"'08'!D45","v":{"$error":"#REF!"}},{"$f":"'08'!E45","v":{"$error":"#REF!"}},{"$f":"'08'!F45","v":{"$error":"#REF!"}},{"$f":"'08'!G45","v":{"$error":"#REF!"}},{"$f":"COUNTIF(C9:C39,\"c\")","v":0},{"$f":"SUM('01'!H45:I45)","v":0}]
[null,{"$f":"'08'!B46","v":"Armée (i) :"},{"$f":"'08'!C46","v":{"$error":"#N/A"}},{"$f":"'08'!D46","v":{"$error":"#REF!"}},{"$f":"'08'!E46","v":{"$error":"#REF!"}},{"$f":"'08'!F46","v":{"$error":"#REF!"}},{"$f":"'08'!G46","v":{"$error":"#REF!"}},{"$f":"COUNTIF(C9:C39,\"i\")","v":0},{"$f":"SUM('01'!H46:I46)","v":0}]
[null,{"$f":"'08'!B47","v":"Congé (d) :"},{"$f":"'08'!C47","v":{"$error":"#N/A"}},{"$f":"'08'!D47","v":{"$error":"#REF!"}},{"$f":"'08'!E47","v":{"$error":"#REF!"}},{"$f":"'08'!F47","v":{"$error":"#REF!"}},{"$f":"'08'!G47","v":{"$error":"#REF!"}},{"$f":"COUNTIF(C9:C39,\"d\")+COUNTIF(C9:C39,\"f\")/2","v":0},{"$f":"SUM('01'!H47:I47)","v":0}]
[289,{"$f":"'08'!B48","v":"Vacances (e) :"},{"$f":"'08'!C48","v":{"$error":"#N/A"}},{"$f":"'08'!D48","v":{"$error":"#REF!"}},{"$f":"'08'!E48","v":{"$error":"#REF!"}},{"$f":"'08'!F48","v":{"$error":"#REF!"}},{"$f":"'08'!G48","v":{"$error":"#REF!"}},{"$f":"COUNTIF(C9:C39,\"e\")","v":0},{"$f":"SUM('01'!H48:I48)","v":0},null,null,{"$f":"'08'!L48","v":"Date :"},null,null,{"$f":"'08'!O48","v":"Maître d'apprentissage : "}]
[290,{"$f":"'08'!B49","v":"Accident (g) :"},{"$f":"'08'!C49","v":{"$error":"#N/A"}},{"$f":"'08'!D49","v":{"$error":"#REF!"}},{"$f":"'08'!E49","v":{"$error":"#REF!"}},{"$f":"'08'!F49","v":{"$error":"#REF!"}},{"$f":"'08'!G49","v":{"$error":"#REF!"}},{"$f":"COUNTIF(C9:C39,\"g\")","v":0},{"$f":"SUM('01'!H49:I49)","v":0}]
[291,{"$f":"'08'!B50","v":"Maladie (h) :"},{"$f":"'08'!C50","v":{"$error":"#N/A"}},{"$f":"'08'!D50","v":{"$error":"#REF!"}},{"$f":"'08'!E50","v":{"$error":"#REF!"}},{"$f":"'08'!F50","v":{"$error":"#REF!"}},{"$f":"'08'!G50","v":{"$error":"#REF!"}},{"$f":"COUNTIF(C9:C39,\"h\")","v":0},{"$f":"SUM('01'!H50:I50)","v":0},null,null,null,null,null,{"$f":"'08'!O50","v":"Apprenti(e) : "}]

{"sheet":"03","index":9,"n_rows":50,"n_cols":17,"rows_kept":50,"cut":false,"hidden":false,"merged":[[40,1,40,6],[41,1,41,6],[32,13,33,13],[32,12,33,12],[32,15,33,15],[32,14,33,14],[45,1,45,6],[49,1,49,6],[42,1,42,6],[46,1,46,6],[43,1,43,6],[44,1,44,6],[47,1,47,6],[48,1,48,6],[19,12,19,13],[26,12,26,13],[27,12,27,13],[6,12,6,16],[7,12,7,13],[43,12,45,16],[32,16,33,16],[2,7,7,7],[2,8,7,8],[2,5,7,5],[2,9,7,9],[4,12,4,16],[5,12,5,16],[1,2,1,9],[0,1,0,9],[0,11,0,16],[2,12,2,13],[2,14,2,15],[2,1,7,1],[2,2,7,2],[2,3,7,3],[2,4,7,4],[2,6,7,6]]}
[null,{"$f":"'08'!B1","v":"Agenda"},null,null,null,null,null,null,null,null,null,{"$f":"'08'!L1","v":"Décompte salaire mensuel"}]
[null,{"$f":"'08'!B2","v":"Apprenti(e)"},{"$f":"\"- \" & TRIM(DB_Apprenti) & \" -\"","v":"-  -"}]
[null,{"$f":"DATE(DB_Annee+1,3,1)","v":"2024-03-01"},{"$f":"'08'!C3","v":"[ a-b-c-d-e-f-g-h-i ]"},{"$f":"'08'!D3","v":"Logis"},{"$f":"'08'!E3","v":"Déjeuner"},{"$f":"'08'!F3","v":"Dîner"},{"$f":"'08'!G3","v":"Souper "},{"$f":"'08'!H3","v":"Montant des\n Prestations en\n nature"},{"$f":"'08'!I3","v":"Montant\n modifié"},{"$f":"'08'!J3","v":"Commentaires \na = Jour de travail\nb = Jour de cours professionel\nc = Jour de cours interentreprises\nd = Jour de congé\ne = Jour de vacances\nf = 1/2 jour de travail, 1/2 jour de congé\ng = Accident (jour entier)\nh = Maladie (jour entier)\ni = Armée"},null,{"$f":"'08'!L3","v":"Mois : "},{"$f":"B3","v":"2024-03-01"},null,{"$f":"'08'!O3","v":"Année :"},{"$f":"'08'!P3","v":0},{"$f":"B3","v":"2024-03-01"}]
[null,null,{"$f":"'08'!C4","v":0},{"$f":"'08'!D4","v":0},{"$f":"'08'!E4","v":0},{"$f":"'08'!F4","v":0},{"$f":"'08'!G4","v":0},{"$f":"'08'!H4","v":0},{"$f":"'08'!I4","v":0},{"$f":"'08'!J4","v":0}]
[null,null,{"$f":"'08'!C5","v":0},{"$f":"'08'!D5","v":0},{"$f":"'08'!E5","v":0},{"$f":"'08'!F5","v":0},{"$f":"'08'!G5","v":0},{"$f":"'08'!H5","v":0},{"$f":"'08'!I5","v":0},{"$f":"'08'!J5","v":0},null,{"$f":"'08'!L5","v":"Maître d'apprentissage : "},{"$f":"TRIM(DB_Maitre)","v":""}]
[null,null,{"$f":"'08'!C6","v":0},{"$f":"'08'!D6","v":0},{"$f":"'08'!E6","v":0},{"$f":"'08'!F6","v":0},{"$f":"'08'!G6","v":0},{"$f":"'08'!H6","v":0},{"$f":"'08'!I6","v":0},{"$f":"'08'!J6","v":0},null,{"$f":"'08'!L6","v":"Lieu : "},{"$f":"TRIM(DB_MaitreLieu)","v":""}]
[null,null,{"$f":"'08'!C7","v":0},{"$f":"'08'!D7","v":0},{"$f":"'08'!E7","v":0},{"$f":"'08'!F7","v":0},{"$f":"'08'!G7","v":0},{"$f":"'08'!H7","v":0},{"$f":"'08'!I7","v":0},{"$f":"'08'!J7","v":0},null,{"$f":"'08'!L7","v":"Apprenti : "},{"$f":"TRIM(DB_Apprenti)","v":""}]
[null,null,{"$f":"'08'!C8","v":0},{"$f":"'08'!D8","v":0},{"$f":"'08'!E8","v":0},{"$f":"'08'!F8","v":0},{"$f":"'08'!G8","v":0},{"$f":"'08'!H8","v":0},{"$f":"'08'!I8","v":0},{"$f":"'08'!J8","v":0},null,{"$f":"'08'!L8","v":"N° AVS : "},{"$f":"TRIM(DB_AVS)","v":""},null,null,{"$f":"'08'!P8","v":"Date de naissance :"},{"$f":"IF(DB_DateNaissance=0,\"\",DB_DateNaissance)","v":""}]
[null,{"$f":"B3","v":"2024-03-01"},null,null,null,null,null,{"$f":"MAX(IF(C9=\"a\",PN_Travail,IF(C9=\"b\",PN_CoursProf,IF(C9=\"c\",PN_CoursIE,IF(C9=\"d\",PN_Conge,0)))),IF(C9=\"e\",PN_Vacances,IF(C9=\"f\",PN_DemiJour,IF(C9=\"g\",PN_Accident,IF(C9=\"h\",PN_Maladie,IF(C9=\"i\",PN_Armee,0))))))","v":0},{"$f":"H9+D9*PN_Logis_Plus+E9*PN_Dejeuner_Plus+F9*PN_Diner_Plus+G9*PN_Souper_Plus","v":0}]
[null,{"$f":"B9+1","v":"2024-03-02"},null,null,null,null,null,0,0]
[230,{"$f":"B10+1","v":"2024-03-03"},null,null,null,null,null,0,0,null,null,{"$f":"'08'!L11","v":"Salaire brut"},{"$f":"IF(PN_EffMoy=0,SUBSTITUTE(VLOOKUP(A11+1,Tb_Traduction,DB_Langue,FALSE),\"***\",TEXT(J40,\"0.00\")),\"\")","v":{"$error":"#N/A"}},null,null,null,{"$f":"IF(OR(PN_EffMoy=0,Nb_Mois<>12),Sa_BaseMensuelArrondi / H42 *C40,Sa_BaseMensuelArrondi)","v":{"$error":"#N/A"}}]
[null,"2024-03-04",null,null,null,null,null,0,0,null,null,{"$f":"'08'!L12","v":"Prime, bonus, gratification"}]
[null,"2024-03-05",null,null,null,null,null,0,0,null,null,{"$f":"'08'!L13","v":"Salaire brut total"},null,null,null,null,{"$f":"SUM(Q11:Q12)","v":{"$error":"#N/A"}}]
[null,"2024-03-06",null,null,null,null,null,0,0]
[null,"2024-03-07",null,null,null,null,null,0,0,null,null,{"$f":"'08'!L15","v":"Déductions"},{"$f":"'08'!M15","v":"Part"},"%"]
[null,"2024-03-08",null,null,null,null,null,0,0,null,null,{"$f":"'08'!L16","v":"Cotisations AVS, AI, APG* : "},"1/2",{"$f":"IF(B3>=DB_SoumisAVS,RS_AVS_Plus,0)","v":5.2999999999999999E-2},null,{"$f":"$Q$13*N16","v":{"$error":"#N/A"}}]
[null,"2024-03-09",null,null,null,null,null,0,0,null,null,{"$f":"'08'!L17","v":"Cotisations AC* : "},"1/2",{"$f":"IF(B3>=DB_SoumisAVS,RS_AC_Plus,0)","v":1.0999999999999999E-2},null,{"$f":"$Q$13*N17","v":{"$error":"#N/A"}}]
[null,"2024-03-10",null,null,null,null,null,0,0,null,null,{"$f":"'08'!L18","v":"Accident non profes.: "},"1/1",{"$f":"RS_ANP_Plus","v":1.6070000000000001E-2},null,{"$f":"$Q$13*N18","v":{"$error":"#N/A"}}]
[null,"2024-03-11",null,null,null,null,null,0,0,null,null,{"$f":"'08'!L19","v":"Indemnité journalière MC : "},"1/2",{"$f":"RS_MC_Plus","v":4.4000000000000003E-3},null,{"$f":"$Q$13*N19","v":{"$error":"#N/A"}}]
[null,"2024-03-12",null,null,null,null,null,0,0,null,null,{"$f":"'08'!L20","v":"Autre déduction : "}]
[null,"2024-03-13",null,null,null,null,null,0,0,null,null,{"$f":"'08'!L21","v":{"$error":"#N/A"}},null,null,null,{"$f":"IF(PN_EffMoy=0,I40,IF(Nb_Mois=12,Sa_NatureMensuelArrondi,Sa_NatureMensuelArrondi*C40/H42))","v":{"$error":"#N/A"}}]
[null,"2024-03-14",null,null,null,null,null,0,0,null,null,{"$f":"'08'!L22","v":"*) Dès le 1er janvier de l'année des 18 ans de l'apprenti(e)"}]
[null,"2024-03-15",null,null,null,null,null,0,0]
[null,"2024-03-16",null,null,null,null,null,0,0,null,null,{"$f":"'08'!L24","v":"A déduire"},null,null,null,null,{"$f":"INT((SUM(P16:P21)*20)+0.5)/20","v":{"$error":"#N/A"}}]
[null,"2024-03-17",null,null,null,null,null,0,0]
[null,"2024-03-18",null,null,null,null,null,0,0,null,null,{"$f":"'08'!L26","v":"Frais et remboursement"}]
[null,"2024-03-19",null,null,null,null,null,0,0,null,null,{"$f":"'08'!L27","v":"Frais : "}]
[null,"2024-03-20",null,null,null,null,null,0,0,null,null,{"$f":"'08'!L28","v":"Autre remboursement : "}]
[null,"2024-03-21",null,null,null,null,null,0,0]
[null,"2024-03-22",null,null,null,null,null,0,0,null,null,{"$f":"'08'!L30","v":"A ajouter"},null,null,null,null,{"$f":"SUM(P27:P28)","v":0}]
[null,"2024-03-23",null,null,null,null,null,0,0]
[null,"2024-03-24",null,null,null,null,null,0,0,null,null,{"$f":"'08'!L32","v":"Versement du mois"},null,null,null,null,{"$f":"Q13+Q30-Q24","v":{"$error":"#N/A"}}]
[null,"2024-03-25",null,null,null,null,null,0,0,null,null,null,{"$f":"'08'!M33","v":"Mois\ncourant"},{"$f":"'08'!N33","v":"Cumul mois\nprécédents"},{"$f":"'08'!O33","v":"Prévus\nannuellement"},null,{"$f":"'08'!Q33","v":"Solde\nactuel"}]
[null,"2024-03-26",null,null,null,null,null,0,0,null,null,{"$f":"'08'!L34","v":"Décompte des jours"},{"$f":"'08'!M34","v":0},{"$f":"'08'!N34","v":0},{"$f":"'08'!O34","v":0},null,{"$f":"'08'!Q34","v":0}]
[null,"2024-03-27",null,null,null,null,null,0,0,null,null,{"$f":"'08'!L35","v":"Travail :"},{"$f":"H43","v":0},0,{"$f":"NJ_Travail","v":{"$error":"#N/A"}},null,{"$f":"O35-N35-M35","v":{"$error":"#N/A"}}]
[null,"2024-03-28",null,null,null,null,null,0,0,null,null,{"$f":"'08'!L36","v":"Cours prof. :"},0,0,{"$f":"NJ_CoursProf","v":{"$error":"#N/A"}},null,{"$error":"#N/A"}]
[null,"2024-03-29",null,null,null,null,null,0,0,null,null,{"$f":"'08'!L37","v":"Cours IE :"},0,0,{"$f":"NJ_CoursIE","v":{"$error":"#N/A"}},null,{"$error":"#N/A"}]
[null,"2024-03-30",null,null,null,null,null,0,0,null,null,{"$f":"'08'!L38","v":"Armée :"},0,0,{"$f":"NJ_Bloc","v":0},null,0]
[null,"2024-03-31",null,null,null,null,null,0,0,null,null,{"$f":"'08'!L39","v":"Congés :"},{"$f":"H47","v":0},0,{"$f":"NJ_Conge","v":{"$error":"#N/A"}},null,{"$error":"#N/A"}]
[null,{"$f":"'08'!B40","v":"Total"},{"$f":"COUNTIF(C9:C39,\"a\")+COUNTIF(C9:C39,\"b\")+COUNTIF(C9:C39,\"c\")+COUNTIF(C9:C39,\"d\")+COUNTIF(C9:C39,\"e\")+COUNTIF(C9:C39,\"f\")+COUNTIF(C9:C39,\"g\")+COUNTIF(C9:C39,\"h\")+COUNTIF(C9:C39,\"i\")","v":0},{"$f":"SUM(D9:D39)","v":0},0,0,0,0,0,{"$f":"INT(((Sa_NatureMensuel / H42 *C40)*20)+0.5)/20","v":{"$error":"#N/A"}},null,{"$f":"'08'!L40","v":"Vacances :"},0,0,{"$f":"NJ_Vacances","v":{"$error":"#N/A"}},null,{"$error":"#N/A"}]
[null,null,null,null,null,null,null,{"$f":"B3","v":"2024-03-01"},{"$f":"'08'!I41","v":"cumul"},null,null,{"$f":"'08'!L41","v":"Accident :"},0,0,0,null,0]
[null,{"$f":"'08'!B42","v":"Décompte des jours"},{"$f":"'08'!C42","v":{"$error":"#N/A"}},{"$f":"'08'!D42","v":{"$error":"#REF!"}},{"$f":"'08'!E42","v":{"$error":"#REF!"}},{"$f":"'08'!F42","v":{"$error":"#REF!"}},{"$f":"'08'!G42","v":{"$error":"#REF!"}},31,{"$f":"SUM('02'!H42:I42)","v":213},null,null,{"$f":"'08'!L42","v":"Maladie :"},0,0,0,null,0]
[null,{"$f":"'08'!B43","v":"Jours de travail (a) :"},{"$f":"'08'!C43","v":{"$error":"#N/A"}},{"$f":"'08'!D43","v":{"$error":"#REF!"}},{"$f":"'08'!E43","v":{"$error":"#REF!"}},{"$f":"'08'!F43","v":{"$error":"#REF!"}},{"$f":"'08'!G43","v":{"$error":"#REF!"}},{"$f":"COUNTIF(C9:C39,\"a\")+COUNTIF(C9:C39,\"f\")/2","v":0},{"$f":"SUM('02'!H43:I43)","v":0}]
[null,{"$f":"'08'!B44","v":"Cours professionnels (b) :"},{"$f":"'08'!C44","v":{"$error":"#N/A"}},{"$f":"'08'!D44","v":{"$error":"#REF!"}},{"$f":"'08'!E44","v":{"$error":"#REF!"}},{"$f":"'08'!F44","v":{"$error":"#REF!"}},{"$f":"'08'!G44","v":{"$error":"#REF!"}},{"$f":"COUNTIF(C9:C39,\"b\")","v":0},{"$f":"SUM('02'!H44:I44)","v":0},null,null,{"$f":"'08'!L44","v":"Remarques : "}]
[null,{"$f":"'08'!B45","v":"Cours interentreprises (c) :"},{"$f":"'08'!C45","v":{"$error":"#N/A"}},{"$f":"'08'!D45","v":{"$error":"#REF!"}},{"$f":"'08'!E45","v":{"$error":"#REF!"}},{"$f":"'08'!F45","v":{"$error":"#REF!"}},{"$f":"'08'!G45","v":{"$error":"#REF!"}},{"$f":"COUNTIF(C9:C39,\"c\")","v":0},{"$f":"SUM('02'!H45:I45)","v":0}]
[null,{"$f":"'08'!B46","v":"Armée (i) :"},{"$f":"'08'!C46","v":{"$error":"#N/A"}},{"$f":"'08'!D46","v":{"$error":"#REF!"}},{"$f":"'08'!E46","v":{"$error":"#REF!"}},{"$f":"'08'!F46","v":{"$error":"#REF!"}},{"$f":"'08'!G46","v":{"$error":"#REF!"}},{"$f":"COUNTIF(C9:C39,\"i\")","v":0},{"$f":"SUM('02'!H46:I46)","v":0}]
[null,{"$f":"'08'!B47","v":"Congé (d) :"},{"$f":"'08'!C47","v":{"$error":"#N/A"}},{"$f":"'08'!D47","v":{"$error":"#REF!"}},{"$f":"'08'!E47","v":{"$error":"#REF!"}},{"$f":"'08'!F47","v":{"$error":"#REF!"}},{"$f":"'08'!G47","v":{"$error":"#REF!"}},{"$f":"COUNTIF(C9:C39,\"d\")+COUNTIF(C9:C39,\"f\")/2","v":0},{"$f":"SUM('02'!H47:I47)","v":0}]
[289,{"$f":"'08'!B48","v":"Vacances (e) :"},{"$f":"'08'!C48","v":{"$error":"#N/A"}},{"$f":"'08'!D48","v":{"$error":"#REF!"}},{"$f":"'08'!E48","v":{"$error":"#REF!"}},{"$f":"'08'!F48","v":{"$error":"#REF!"}},{"$f":"'08'!G48","v":{"$error":"#REF!"}},{"$f":"COUNTIF(C9:C39,\"e\")","v":0},{"$f":"SUM('02'!H48:I48)","v":0},null,null,{"$f":"'08'!L48","v":"Date :"},null,null,{"$f":"'08'!O48","v":"Maître d'apprentissage : "}]
[290,{"$f":"'08'!B49","v":"Accident (g) :"},{"$f":"'08'!C49","v":{"$error":"#N/A"}},{"$f":"'08'!D49","v":{"$error":"#REF!"}},{"$f":"'08'!E49","v":{"$error":"#REF!"}},{"$f":"'08'!F49","v":{"$error":"#REF!"}},{"$f":"'08'!G49","v":{"$error":"#REF!"}},{"$f":"COUNTIF(C9:C39,\"g\")","v":0},{"$f":"SUM('02'!H49:I49)","v":0}]
[291,{"$f":"'08'!B50","v":"Maladie (h) :"},{"$f":"'08'!C50","v":{"$error":"#N/A"}},{"$f":"'08'!D50","v":{"$error":"#REF!"}},{"$f":"'08'!E50","v":{"$error":"#REF!"}},{"$f":"'08'!F50","v":{"$error":"#REF!"}},{"$f":"'08'!G50","v":{"$error":"#REF!"}},{"$f":"COUNTIF(C9:C39,\"h\")","v":0},{"$f":"SUM('02'!H50:I50)","v":0},null,null,null,null,null,{"$f":"'08'!O50","v":"Apprenti(e) : "}]

{"sheet":"04","index":10,"n_rows":50,"n_cols":17,"rows_kept":50,"cut":false,"hidden":false,"merged":[[40,1,40,6],[41,1,41,6],[32,13,33,13],[32,12,33,12],[32,15,33,15],[32,14,33,14],[45,1,45,6],[49,1,49,6],[42,1,42,6],[46,1,46,6],[43,1,43,6],[44,1,44,6],[47,1,47,6],[48,1,48,6],[19,12,19,13],[26,12,26,13],[27,12,27,13],[6,12,6,16],[7,12,7,13],[43,12,45,16],[32,16,33,16],[2,7,7,7],[2,8,7,8],[2,5,7,5],[2,9,7,9],[4,12,4,16],[5,12,5,16],[1,2,1,9],[0,1,0,9],[0,11,0,16],[2,12,2,13],[2,14,2,15],[2,1,7,1],[2,2,7,2],[2,3,7,3],[2,4,7,4],[2,6,7,6]]}
[null,{"$f":"'08'!B1","v":"Agenda"},null,null,null,null,null,null,null,null,null,{"$f":"'08'!L1","v":"Décompte salaire mensuel"}]
[null,{"$f":"'08'!B2","v":"Apprenti(e)"},{"$f":"\"- \" & TRIM(DB_Apprenti) & \" -\"","v":"-  -"}]
[null,{"$f":"DATE(DB_Annee+1,4,1)","v":"2024-04-01"},{"$f":"'08'!C3","v":"[ a-b-c-d-e-f-g-h-i ]"},{"$f":"'08'!D3","v":"Logis"},{"$f":"'08'!E3","v":"Déjeuner"},{"$f":"'08'!F3","v":"Dîner"},{"$f":"'08'!G3","v":"Souper "},{"$f":"'08'!H3","v":"Montant des\n Prestations en\n nature"},{"$f":"'08'!I3","v":"Montant\n modifié"},{"$f":"'08'!J3","v":"Commentaires \na = Jour de travail\nb = Jour de cours professionel\nc = Jour de cours interentreprises\nd = Jour de congé\ne = Jour de vacances\nf = 1/2 jour de travail, 1/2 jour de congé\ng = Accident (jour entier)\nh = Maladie (jour entier)\ni = Armée"},null,{"$f":"'08'!L3","v":"Mois : "},{"$f":"B3","v":"2024-04-01"},null,{"$f":"'08'!O3","v":"Année :"},{"$f":"'08'!P3","v":0},{"$f":"B3","v":"2024-04-01"}]
[null,null,{"$f":"'08'!C4","v":0},{"$f":"'08'!D4","v":0},{"$f":"'08'!E4","v":0},{"$f":"'08'!F4","v":0},{"$f":"'08'!G4","v":0},{"$f":"'08'!H4","v":0},{"$f":"'08'!I4","v":0},{"$f":"'08'!J4","v":0}]
[null,null,{"$f":"'08'!C5","v":0},{"$f":"'08'!D5","v":0},{"$f":"'08'!E5","v":0},{"$f":"'08'!F5","v":0},{"$f":"'08'!G5","v":0},{"$f":"'08'!H5","v":0},{"$f":"'08'!I5","v":0},{"$f":"'08'!J5","v":0},null,{"$f":"'08'!L5","v":"Maître d'apprentissage : "},{"$f":"TRIM(DB_Maitre)","v":""}]
[null,null,{"$f":"'08'!C6","v":0},{"$f":"'08'!D6","v":0},{"$f":"'08'!E6","v":0},{"$f":"'08'!F6","v":0},{"$f":"'08'!G6","v":0},{"$f":"'08'!H6","v":0},{"$f":"'08'!I6","v":0},{"$f":"'08'!J6","v":0},null,{"$f":"'08'!L6","v":"Lieu : "},{"$f":"TRIM(DB_MaitreLieu)","v":""}]
[null,null,{"$f":"'08'!C7","v":0},{"$f":"'08'!D7","v":0},{"$f":"'08'!E7","v":0},{"$f":"'08'!F7","v":0},{"$f":"'08'!G7","v":0},{"$f":"'08'!H7","v":0},{"$f":"'08'!I7","v":0},{"$f":"'08'!J7","v":0},null,{"$f":"'08'!L7","v":"Apprenti : "},{"$f":"TRIM(DB_Apprenti)","v":""}]
[null,null,{"$f":"'08'!C8","v":0},{"$f":"'08'!D8","v":0},{"$f":"'08'!E8","v":0},{"$f":"'08'!F8","v":0},{"$f":"'08'!G8","v":0},{"$f":"'08'!H8","v":0},{"$f":"'08'!I8","v":0},{"$f":"'08'!J8","v":0},null,{"$f":"'08'!L8","v":"N° AVS : "},{"$f":"TRIM(DB_AVS)","v":""},null,null,{"$f":"'08'!P8","v":"Date de naissance :"},{"$f":"IF(DB_DateNaissance=0,\"\",DB_DateNaissance)","v":""}]
[null,{"$f":"B3","v":"2024-04-01"},null,null,null,null,null,{"$f":"MAX(IF(C9=\"a\",PN_Travail,IF(C9=\"b\",PN_CoursProf,IF(C9=\"c\",PN_CoursIE,IF(C9=\"d\",PN_Conge,0)))),IF(C9=\"e\",PN_Vacances,IF(C9=\"f\",PN_DemiJour,IF(C9=\"g\",PN_Accident,IF(C9=\"h\",PN_Maladie,IF(C9=\"i\",PN_Armee,0))))))","v":0},{"$f":"H9+D9*PN_Logis_Plus+E9*PN_Dejeuner_Plus+F9*PN_Diner_Plus+G9*PN_Souper_Plus","v":0}]
[null,{"$f":"B9+1","v":"2024-04-02"},null,null,null,null,null,0,0]
[230,{"$f":"B10+1","v":"2024-04-03"},null,null,null,null,null,0,0,null,null,{"$f":"'08'!L11","v":"Salaire brut"},{"$f":"IF(PN_EffMoy=0,SUBSTITUTE(VLOOKUP(A11+1,Tb_Traduction,DB_Langue,FALSE),\"***\",TEXT(J40,\"0.00\")),\"\")","v":{"$error":"#N/A"}},null,null,null,{"$f":"IF(OR(PN_EffMoy=0,Nb_Mois<>12),Sa_BaseMensuelArrondi / H42 *C40,Sa_BaseMensuelArrondi)","v":{"$error":"#N/A"}}]
[null,"2024-04-04",null,null,null,null,null,0,0,null,null,{"$f":"'08'!L12","v":"Prime, bonus, gratification"}]
[null,"2024-04-05",null,null,null,null,null,0,0,null,null,{"$f":"'08'!L13","v":"Salaire brut total"},null,null,null,null,{"$f":"SUM(Q11:Q12)","v":{"$error":"#N/A"}}]
[null,"2024-04-06",null,null,null,null,null,0,0]
[null,"2024-04-07",null,null,null,null,null,0,0,null,null,{"$f":"'08'!L15","v":"Déductions"},{"$f":"'08'!M15","v":"Part"},"%"]
[null,"2024-04-08",null,null,null,null,null,0,0,null,null,{"$f":"'08'!L16","v":"Cotisations AVS, AI, APG* : "},"1/2",{"$f":"IF(B3>=DB_SoumisAVS,RS_AVS_Plus,0)","v":5.2999999999999999E-2},null,{"$f":"$Q$13*N16","v":{"$error":"#N/A"}}]
[null,"2024-04-09",null,null,null,null,null,0,0,null,null,{"$f":"'08'!L17","v":"Cotisations AC* : "},"1/2",{"$f":"IF(B3>=DB_SoumisAVS,RS_AC_Plus,0)","v":1.0999999999999999E-2},null,{"$f":"$Q$13*N17","v":{"$error":"#N/A"}}]
[null,"2024-04-10",null,null,null,null,null,0,0,null,null,{"$f":"'08'!L18","v":"Accident non profes.: "},"1/1",{"$f":"RS_ANP_Plus","v":1.6070000000000001E-2},null,{"$f":"$Q$13*N18","v":{"$error":"#N/A"}}]
[null,"2024-04-11",null,null,null,null,null,0,0,null,null,{"$f":"'08'!L19","v":"Indemnité journalière MC : "},"1/2",{"$f":"RS_MC_Plus","v":4.4000000000000003E-3},null,{"$f":"$Q$13*N19","v":{"$error":"#N/A"}}]
[null,"2024-04-12",null,null,null,null,null,0,0,null,null,{"$f":"'08'!L20","v":"Autre déduction : "}]
[null,"2024-04-13",null,null,null,null,null,0,0,null,null,{"$f":"'08'!L21","v":{"$error":"#N/A"}},null,null,null,{"$f":"IF(PN_EffMoy=0,I40,IF(Nb_Mois=12,Sa_NatureMensuelArrondi,Sa_NatureMensuelArrondi*C40/H42))","v":{"$error":"#N/A"}}]
[null,"2024-04-14",null,null,null,null,null,0,0,null,null,{"$f":"'08'!L22","v":"*) Dès le 1er janvier de l'année des 18 ans de l'apprenti(e)"}]
[null,"2024-04-15",null,null,null,null,null,0,0]
[null,"2024-04-16",null,null,null,null,null,0,0,null,null,{"$f":"'08'!L24","v":"A déduire"},null,null,null,null,{"$f":"INT((SUM(P16:P21)*20)+0.5)/20","v":{"$error":"#N/A"}}]
[null,"2024-04-17",null,null,null,null,null,0,0]
[null,"2024-04-18",null,null,null,null,null,0,0,null,null,{"$f":"'08'!L26","v":"Frais et remboursement"}]
[null,"2024-04-19",null,null,null,null,null,0,0,null,null,{"$f":"'08'!L27","v":"Frais : "}]
[null,"2024-04-20",null,null,null,null,null,0,0,null,null,{"$f":"'08'!L28","v":"Autre remboursement : "}]
[null,"2024-04-21",null,null,null,null,null,0,0]
[null,"2024-04-22",null,null,null,null,null,0,0,null,null,{"$f":"'08'!L30","v":"A ajouter"},null,null,null,null,{"$f":"SUM(P27:P28)","v":0}]
[null,"2024-04-23",null,null,null,null,null,0,0]
[null,"2024-04-24",null,null,null,null,null,0,0,null,null,{"$f":"'08'!L32","v":"Versement du mois"},null,null,null,null,{"$f":"Q13+Q30-Q24","v":{"$error":"#N/A"}}]
[null,"2024-04-25",null,null,null,null,null,0,0,null,null,null,{"$f":"'08'!M33","v":"Mois\ncourant"},{"$f":"'08'!N33","v":"Cumul mois\nprécédents"},{"$f":"'08'!O33","v":"Prévus\nannuellement"},null,{"$f":"'08'!Q33","v":"Solde\nactuel"}]
[null,"2024-04-26",null,null,null,null,null,0,0,null,null,{"$f":"'08'!L34","v":"Décompte des jours"},{"$f":"'08'!M34","v":0},{"$f":"'08'!N34","v":0},{"$f":"'08'!O34","v":0},null,{"$f":"'08'!Q34","v":0}]
[null,"2024-04-27",null,null,null,null,null,0,0,null,null,{"$f":"'08'!L35","v":"Travail :"},{"$f":"H43","v":0},0,{"$f":"NJ_Travail","v":{"$error":"#N/A"}},null,{"$f":"O35-N35-M35","v":{"$error":"#N/A"}}]
[null,"2024-04-28",null,null,null,null,null,0,0,null,null,{"$f":"'08'!L36","v":"Cours prof. :"},0,0,{"$f":"NJ_CoursProf","v":{"$error":"#N/A"}},null,{"$error":"#N/A"}]
[null,"2024-04-29",null,null,null,null,null,0,0,null,null,{"$f":"'08'!L37","v":"Cours IE :"},0,0,{"$f":"NJ_CoursIE","v":{"$error":"#N/A"}},null,{"$error":"#N/A"}]
[null,"2024-04-30",null,null,null,null,null,0,0,null,null,{"$f":"'08'!L38","v":"Armée :"},0,0,{"$f":"NJ_Bloc","v":0},null,0]
[null,null,null,null,null,null,null,0,0,null,null,{"$f":"'08'!L39","v":"Congés :"},{"$f":"H47","v":0},0,{"$f":"NJ_Conge","v":{"$error":"#N/A"}},null,{"$error":"#N/A"}]
[null,{"$f":"'08'!B40","v":"Total"},{"$f":"COUNTIF(C9:C39,\"a\")+COUNTIF(C9:C39,\"b\")+COUNTIF(C9:C39,\"c\")+COUNTIF(C9:C39,\"d\")+COUNTIF(C9:C39,\"e\")+COUNTIF(C9:C39,\"f\")+COUNTIF(C9:C39,\"g\")+COUNTIF(C9:C39,\"h\")+COUNTIF(C9:C39,\"i\")","v":0},{"$f":"SUM(D9:D39)","v":0},0,0,0,0,0,{"$f":"INT(((Sa_NatureMensuel / H42 *C40)*20)+0.5)/20","v":{"$error":"#N/A"}},null,{"$f":"'08'!L40","v":"Vacances :"},0,0,{"$f":"NJ_Vacances","v":{"$error":"#N/A"}},null,{"$error":"#N/A"}]
[null,null,null,null,null,null,null,{"$f":"B3","v":"2024-04-01"},{"$f":"'08'!I41","v":"cumul"},null,null,{"$f":"'08'!L41","v":"Accident :"},0,0,0,null,0]
[null,{"$f":"'08'!B42","v":"Décompte des jours"},{"$f":"'08'!C42","v":{"$error":"#N/A"}},{"$f":"'08'!D42","v":{"$error":"#REF!"}},{"$f":"'08'!E42","v":{"$error":"#REF!"}},{"$f":"'08'!F42","v":{"$error":"#REF!"}},{"$f":"'08'!G42","v":{"$error":"#REF!"}},30,{"$f":"SUM('03'!H42:I42)","v":244},null,null,{"$f":"'08'!L42","v":"Maladie :"},0,0,0,null,0]
[null,{"$f":"'08'!B43","v":"Jours de travail (a) :"},{"$f":"'08'!C43","v":{"$error":"#N/A"}},{"$f":"'08'!D43","v":{"$error":"#REF!"}},{"$f":"'08'!E43","v":{"$error":"#REF!"}},{"$f":"'08'!F43","v":{"$error":"#REF!"}},{"$f":"'08'!G43","v":{"$error":"#REF!"}},{"$f":"COUNTIF(C9:C39,\"a\")+COUNTIF(C9:C39,\"f\")/2","v":0},{"$f":"SUM('03'!H43:I43)","v":0}]
[null,{"$f":"'08'!B44","v":"Cours professionnels (b) :"},{"$f":"'08'!C44","v":{"$error":"#N/A"}},{"$f":"'08'!D44","v":{"$error":"#REF!"}},{"$f":"'08'!E44","v":{"$error":"#REF!"}},{"$f":"'08'!F44","v":{"$error":"#REF!"}},{"$f":"'08'!G44","v":{"$error":"#REF!"}},{"$f":"COUNTIF(C9:C39,\"b\")","v":0},{"$f":"SUM('03'!H44:I44)","v":0},null,null,{"$f":"'08'!L44","v":"Remarques : "}]
[null,{"$f":"'08'!B45","v":"Cours interentreprises (c) :"},{"$f":"'08'!C45","v":{"$error":"#N/A"}},{"$f":"'08'!D45","v":{"$error":"#REF!"}},{"$f":"'08'!E45","v":{"$error":"#REF!"}},{"$f":"'08'!F45","v":{"$error":"#REF!"}},{"$f":"'08'!G45","v":{"$error":"#REF!"}},{"$f":"COUNTIF(C9:C39,\"c\")","v":0},{"$f":"SUM('03'!H45:I45)","v":0}]
[null,{"$f":"'08'!B46","v":"Armée (i) :"},{"$f":"'08'!C46","v":{"$error":"#N/A"}},{"$f":"'08'!D46","v":{"$error":"#REF!"}},{"$f":"'08'!E46","v":{"$error":"#REF!"}},{"$f":"'08'!F46","v":{"$error":"#REF!"}},{"$f":"'08'!G46","v":{"$error":"#REF!"}},{"$f":"COUNTIF(C9:C39,\"i\")","v":0},{"$f":"SUM('03'!H46:I46)","v":0}]
[null,{"$f":"'08'!B47","v":"Congé (d) :"},{"$f":"'08'!C47","v":{"$error":"#N/A"}},{"$f":"'08'!D47","v":{"$error":"#REF!"}},{"$f":"'08'!E47","v":{"$error":"#REF!"}},{"$f":"'08'!F47","v":{"$error":"#REF!"}},{"$f":"'08'!G47","v":{"$error":"#REF!"}},{"$f":"COUNTIF(C9:C39,\"d\")+COUNTIF(C9:C39,\"f\")/2","v":0},{"$f":"SUM('03'!H47:I47)","v":0}]
[289,{"$f":"'08'!B48","v":"Vacances (e) :"},{"$f":"'08'!C48","v":{"$error":"#N/A"}},{"$f":"'08'!D48","v":{"$error":"#REF!"}},{"$f":"'08'!E48","v":{"$error":"#REF!"}},{"$f":"'08'!F48","v":{"$error":"#REF!"}},{"$f":"'08'!G48","v":{"$error":"#REF!"}},{"$f":"COUNTIF(C9:C39,\"e\")","v":0},{"$f":"SUM('03'!H48:I48)","v":0},null,null,{"$f":"'08'!L48","v":"Date :"},null,null,{"$f":"'08'!O48","v":"Maître d'apprentissage : "}]
[290,{"$f":"'08'!B49","v":"Accident (g) :"},{"$f":"'08'!C49","v":{"$error":"#N/A"}},{"$f":"'08'!D49","v":{"$error":"#REF!"}},{"$f":"'08'!E49","v":{"$error":"#REF!"}},{"$f":"'08'!F49","v":{"$error":"#REF!"}},{"$f":"'08'!G49","v":{"$error":"#REF!"}},{"$f":"COUNTIF(C9:C39,\"g\")","v":0},{"$f":"SUM('03'!H49:I49)","v":0}]
[291,{"$f":"'08'!B50","v":"Maladie (h) :"},{"$f":"'08'!C50","v":{"$error":"#N/A"}},{"$f":"'08'!D50","v":{"$error":"#REF!"}},{"$f":"'08'!E50","v":{"$error":"#REF!"}},{"$f":"'08'!F50","v":{"$error":"#REF!"}},{"$f":"'08'!G50","v":{"$error":"#REF!"}},{"$f":"COUNTIF(C9:C39,\"h\")","v":0},{"$f":"SUM('03'!H50:I50)","v":0},null,null,null,null,null,{"$f":"'08'!O50","v":"Apprenti(e) : "}]

{"sheet":"05","index":11,"n_rows":50,"n_cols":17,"rows_kept":50,"cut":false,"hidden":false,"merged":[[40,1,40,6],[41,1,41,6],[32,13,33,13],[32,12,33,12],[32,15,33,15],[32,14,33,14],[45,1,45,6],[49,1,49,6],[42,1,42,6],[46,1,46,6],[43,1,43,6],[44,1,44,6],[47,1,47,6],[48,1,48,6],[19,12,19,13],[26,12,26,13],[27,12,27,13],[6,12,6,16],[7,12,7,13],[43,12,45,16],[32,16,33,16],[2,7,7,7],[2,8,7,8],[2,5,7,5],[2,9,7,9],[4,12,4,16],[5,12,5,16],[1,2,1,9],[0,1,0,9],[0,11,0,16],[2,12,2,13],[2,14,2,15],[2,1,7,1],[2,2,7,2],[2,3,7,3],[2,4,7,4],[2,6,7,6]]}
[null,{"$f":"'08'!B1","v":"Agenda"},null,null,null,null,null,null,null,null,null,{"$f":"'08'!L1","v":"Décompte salaire mensuel"}]
[null,{"$f":"'08'!B2","v":"Apprenti(e)"},{"$f":"\"- \" & TRIM(DB_Apprenti) & \" -\"","v":"-  -"}]
[null,{"$f":"DATE(DB_Annee+1,5,1)","v":"2024-05-01"},{"$f":"'08'!C3","v":"[ a-b-c-d-e-f-g-h-i ]"},{"$f":"'08'!D3","v":"Logis"},{"$f":"'08'!E3","v":"Déjeuner"},{"$f":"'08'!F3","v":"Dîner"},{"$f":"'08'!G3","v":"Souper "},{"$f":"'08'!H3","v":"Montant des\n Prestations en\n nature"},{"$f":"'08'!I3","v":"Montant\n modifié"},{"$f":"'08'!J3","v":"Commentaires \na = Jour de travail\nb = Jour de cours professionel\nc = Jour de cours interentreprises\nd = Jour de congé\ne = Jour de vacances\nf = 1/2 jour de travail, 1/2 jour de congé\ng = Accident (jour entier)\nh = Maladie (jour entier)\ni = Armée"},null,{"$f":"'08'!L3","v":"Mois : "},{"$f":"B3","v":"2024-05-01"},null,{"$f":"'08'!O3","v":"Année :"},{"$f":"'08'!P3","v":0},{"$f":"B3","v":"2024-05-01"}]
[null,null,{"$f":"'08'!C4","v":0},{"$f":"'08'!D4","v":0},{"$f":"'08'!E4","v":0},{"$f":"'08'!F4","v":0},{"$f":"'08'!G4","v":0},{"$f":"'08'!H4","v":0},{"$f":"'08'!I4","v":0},{"$f":"'08'!J4","v":0}]
[null,null,{"$f":"'08'!C5","v":0},{"$f":"'08'!D5","v":0},{"$f":"'08'!E5","v":0},{"$f":"'08'!F5","v":0},{"$f":"'08'!G5","v":0},{"$f":"'08'!H5","v":0},{"$f":"'08'!I5","v":0},{"$f":"'08'!J5","v":0},null,{"$f":"'08'!L5","v":"Maître d'apprentissage : "},{"$f":"TRIM(DB_Maitre)","v":""}]
[null,null,{"$f":"'08'!C6","v":0},{"$f":"'08'!D6","v":0},{"$f":"'08'!E6","v":0},{"$f":"'08'!F6","v":0},{"$f":"'08'!G6","v":0},{"$f":"'08'!H6","v":0},{"$f":"'08'!I6","v":0},{"$f":"'08'!J6","v":0},null,{"$f":"'08'!L6","v":"Lieu : "},{"$f":"TRIM(DB_MaitreLieu)","v":""}]
[null,null,{"$f":"'08'!C7","v":0},{"$f":"'08'!D7","v":0},{"$f":"'08'!E7","v":0},{"$f":"'08'!F7","v":0},{"$f":"'08'!G7","v":0},{"$f":"'08'!H7","v":0},{"$f":"'08'!I7","v":0},{"$f":"'08'!J7","v":0},null,{"$f":"'08'!L7","v":"Apprenti : "},{"$f":"TRIM(DB_Apprenti)","v":""}]
[null,null,{"$f":"'08'!C8","v":0},{"$f":"'08'!D8","v":0},{"$f":"'08'!E8","v":0},{"$f":"'08'!F8","v":0},{"$f":"'08'!G8","v":0},{"$f":"'08'!H8","v":0},{"$f":"'08'!I8","v":0},{"$f":"'08'!J8","v":0},null,{"$f":"'08'!L8","v":"N° AVS : "},{"$f":"TRIM(DB_AVS)","v":""},null,null,{"$f":"'08'!P8","v":"Date de naissance :"},{"$f":"IF(DB_DateNaissance=0,\"\",DB_DateNaissance)","v":""}]
[null,{"$f":"B3","v":"2024-05-01"},null,null,null,null,null,{"$f":"MAX(IF(C9=\"a\",PN_Travail,IF(C9=\"b\",PN_CoursProf,IF(C9=\"c\",PN_CoursIE,IF(C9=\"d\",PN_Conge,0)))),IF(C9=\"e\",PN_Vacances,IF(C9=\"f\",PN_DemiJour,IF(C9=\"g\",PN_Accident,IF(C9=\"h\",PN_Maladie,IF(C9=\"i\",PN_Armee,0))))))","v":0},{"$f":"H9+D9*PN_Logis_Plus+E9*PN_Dejeuner_Plus+F9*PN_Diner_Plus+G9*PN_Souper_Plus","v":0}]
[null,{"$f":"B9+1","v":"2024-05-02"},null,null,null,null,null,0,0]
[230,{"$f":"B10+1","v":"2024-05-03"},null,null,null,null,null,0,0,null,null,{"$f":"'08'!L11","v":"Salaire brut"},{"$f":"IF(PN_EffMoy=0,SUBSTITUTE(VLOOKUP(A11+1,Tb_Traduction,DB_Langue,FALSE),\"***\",TEXT(J40,\"0.00\")),\"\")","v":{"$error":"#N/A"}},null,null,null,{"$f":"IF(OR(PN_EffMoy=0,Nb_Mois<>12),Sa_BaseMensuelArrondi / H42 *C40,Sa_BaseMensuelArrondi)","v":{"$error":"#N/A"}}]
[null,"2024-05-04",null,null,null,null,null,0,0,null,null,{"$f":"'08'!L12","v":"Prime, bonus, gratification"}]
[null,"2024-05-05",null,null,null,null,null,0,0,null,null,{"$f":"'08'!L13","v":"Salaire brut total"},null,null,null,null,{"$f":"SUM(Q11:Q12)","v":{"$error":"#N/A"}}]
[null,"2024-05-06",null,null,null,null,null,0,0]
[null,"2024-05-07",null,null,null,null,null,0,0,null,null,{"$f":"'08'!L15","v":"Déductions"},{"$f":"'08'!M15","v":"Part"},"%"]
[null,"2024-05-08",null,null,null,null,null,0,0,null,null,{"$f":"'08'!L16","v":"Cotisations AVS, AI, APG* : "},"1/2",{"$f":"IF(B3>=DB_SoumisAVS,RS_AVS_Plus,0)","v":5.2999999999999999E-2},null,{"$f":"$Q$13*N16","v":{"$error":"#N/A"}}]
[null,"2024-05-09",null,null,null,null,null,0,0,null,null,{"$f":"'08'!L17","v":"Cotisations AC* : "},"1/2",{"$f":"IF(B3>=DB_SoumisAVS,RS_AC_Plus,0)","v":1.0999999999999999E-2},null,{"$f":"$Q$13*N17","v":{"$error":"#N/A"}}]
[null,"2024-05-10",null,null,null,null,null,0,0,null,null,{"$f":"'08'!L18","v":"Accident non profes.: "},"1/1",{"$f":"RS_ANP_Plus","v":1.6070000000000001E-2},null,{"$f":"$Q$13*N18","v":{"$error":"#N/A"}}]
[null,"2024-05-11",null,null,null,null,null,0,0,null,null,{"$f":"'08'!L19","v":"Indemnité journalière MC : "},"1/2",{"$f":"RS_MC_Plus","v":4.4000000000000003E-3},null,{"$f":"$Q$13*N19","v":{"$error":"#N/A"}}]
[null,"2024-05-12",null,null,null,null,null,0,0,null,null,{"$f":"'08'!L20","v":"Autre déduction : "}]
[null,"2024-05-13",null,null,null,null,null,0,0,null,null,{"$f":"'08'!L21","v":{"$error":"#N/A"}},null,null,null,{"$f":"IF(PN_EffMoy=0,I40,IF(Nb_Mois=12,Sa_NatureMensuelArrondi,Sa_NatureMensuelArrondi*C40/H42))","v":{"$error":"#N/A"}}]
[null,"2024-05-14",null,null,null,null,null,0,0,null,null,{"$f":"'08'!L22","v":"*) Dès le 1er janvier de l'année des 18 ans de l'apprenti(e)"}]
[null,"2024-05-15",null,null,null,null,null,0,0]
[null,"2024-05-16",null,null,null,null,null,0,0,null,null,{"$f":"'08'!L24","v":"A déduire"},null,null,null,null,{"$f":"INT((SUM(P16:P21)*20)+0.5)/20","v":{"$error":"#N/A"}}]
[null,"2024-05-17",null,null,null,null,null,0,0]
[null,"2024-05-18",null,null,null,null,null,0,0,null,null,{"$f":"'08'!L26","v":"Frais et remboursement"}]
[null,"2024-05-19",null,null,null,null,null,0,0,null,null,{"$f":"'08'!L27","v":"Frais : "}]
[null,"2024-05-20",null,null,null,null,null,0,0,null,null,{"$f":"'08'!L28","v":"Autre remboursement : "}]
[null,"2024-05-21",null,null,null,null,null,0,0]
[null,"2024-05-22",null,null,null,null,null,0,0,null,null,{"$f":"'08'!L30","v":"A ajouter"},null,null,null,null,{"$f":"SUM(P27:P28)","v":0}]
[null,"2024-05-23",null,null,null,null,null,0,0]
[null,"2024-05-24",null,null,null,null,null,0,0,null,null,{"$f":"'08'!L32","v":"Versement du mois"},null,null,null,null,{"$f":"Q13+Q30-Q24","v":{"$error":"#N/A"}}]
[null,"2024-05-25",null,null,null,null,null,0,0,null,null,null,{"$f":"'08'!M33","v":"Mois\ncourant"},{"$f":"'08'!N33","v":"Cumul mois\nprécédents"},{"$f":"'08'!O33","v":"Prévus\nannuellement"},null,{"$f":"'08'!Q33","v":"Solde\nactuel"}]
[null,"2024-05-26",null,null,null,null,null,0,0,null,null,{"$f":"'08'!L34","v":"Décompte des jours"},{"$f":"'08'!M34","v":0},{"$f":"'08'!N34","v":0},{"$f":"'08'!O34","v":0},null,{"$f":"'08'!Q34","v":0}]
[null,"2024-05-27",null,null,null,null,null,0,0,null,null,{"$f":"'08'!L35","v":"Travail :"},{"$f":"H43","v":0},0,{"$f":"NJ_Travail","v":{"$error":"#N/A"}},null,{"$f":"O35-N35-M35","v":{"$error":"#N/A"}}]
[null,"2024-05-28",null,null,null,null,null,0,0,null,null,{"$f":"'08'!L36","v":"Cours prof. :"},0,0,{"$f":"NJ_CoursProf","v":{"$error":"#N/A"}},null,{"$error":"#N/A"}]
[null,"2024-05-29",null,null,null,null,null,0,0,null,null,{"$f":"'08'!L37","v":"Cours IE :"},0,0,{"$f":"NJ_CoursIE","v":{"$error":"#N/A"}},null,{"$error":"#N/A"}]
[null,"2024-05-30",null,null,null,null,null,0,0,null,null,{"$f":"'08'!L38","v":"Armée :"},0,0,{"$f":"NJ_Bloc","v":0},null,0]
[null,"2024-05-31",null,null,null,null,null,0,0,null,null,{"$f":"'08'!L39","v":"Congés :"},{"$f":"H47","v":0},0,{"$f":"NJ_Conge","v":{"$error":"#N/A"}},null,{"$error":"#N/A"}]
[null,{"$f":"'08'!B40","v":"Total"},{"$f":"COUNTIF(C9:C39,\"a\")+COUNTIF(C9:C39,\"b\")+COUNTIF(C9:C39,\"c\")+COUNTIF(C9:C39,\"d\")+COUNTIF(C9:C39,\"e\")+COUNTIF(C9:C39,\"f\")+COUNTIF(C9:C39,\"g\")+COUNTIF(C9:C39,\"h\")+COUNTIF(C9:C39,\"i\")","v":0},{"$f":"SUM(D9:D39)","v":0},0,0,0,0,0,{"$f":"INT(((Sa_NatureMensuel / H42 *C40)*20)+0.5)/20","v":{"$error":"#N/A"}},null,{"$f":"'08'!L40","v":"Vacances :"},0,0,{"$f":"NJ_Vacances","v":{"$error":"#N/A"}},null,{"$error":"#N/A"}]
[null,null,null,null,null,null,null,{"$f":"B3","v":"2024-05-01"},{"$f":"'08'!I41","v":"cumul"},null,null,{"$f":"'08'!L41","v":"Accident :"},0,0,0,null,0]
[null,{"$f":"'08'!B42","v":"Décompte des jours"},{"$f":"'08'!C42","v":{"$error":"#N/A"}},{"$f":"'08'!D42","v":{"$error":"#REF!"}},{"$f":"'08'!E42","v":{"$error":"#REF!"}},{"$f":"'08'!F42","v":{"$error":"#REF!"}},{"$f":"'08'!G42","v":{"$error":"#REF!"}},31,{"$f":"SUM('04'!H42:I42)","v":274},null,null,{"$f":"'08'!L42","v":"Maladie :"},0,0,0,null,0]
[null,{"$f":"'08'!B43","v":"Jours de travail (a) :"},{"$f":"'08'!C43","v":{"$error":"#N/A"}},{"$f":"'08'!D43","v":{"$error":"#REF!"}},{"$f":"'08'!E43","v":{"$error":"#REF!"}},{"$f":"'08'!F43","v":{"$error":"#REF!"}},{"$f":"'08'!G43","v":{"$error":"#REF!"}},{"$f":"COUNTIF(C9:C39,\"a\")+COUNTIF(C9:C39,\"f\")/2","v":0},{"$f":"SUM('04'!H43:I43)","v":0}]
[null,{"$f":"'08'!B44","v":"Cours professionnels (b) :"},{"$f":"'08'!C44","v":{"$error":"#N/A"}},{"$f":"'08'!D44","v":{"$error":"#REF!"}},{"$f":"'08'!E44","v":{"$error":"#REF!"}},{"$f":"'08'!F44","v":{"$error":"#REF!"}},{"$f":"'08'!G44","v":{"$error":"#REF!"}},{"$f":"COUNTIF(C9:C39,\"b\")","v":0},{"$f":"SUM('04'!H44:I44)","v":0},null,null,{"$f":"'08'!L44","v":"Remarques : "}]
[null,{"$f":"'08'!B45","v":"Cours interentreprises (c) :"},{"$f":"'08'!C45","v":{"$error":"#N/A"}},{"$f":"'08'!D45","v":{"$error":"#REF!"}},{"$f":"'08'!E45","v":{"$error":"#REF!"}},{"$f":"'08'!F45","v":{"$error":"#REF!"}},{"$f":"'08'!G45","v":{"$error":"#REF!"}},{"$f":"COUNTIF(C9:C39,\"c\")","v":0},{"$f":"SUM('04'!H45:I45)","v":0}]
[null,{"$f":"'08'!B46","v":"Armée (i) :"},{"$f":"'08'!C46","v":{"$error":"#N/A"}},{"$f":"'08'!D46","v":{"$error":"#REF!"}},{"$f":"'08'!E46","v":{"$error":"#REF!"}},{"$f":"'08'!F46","v":{"$error":"#REF!"}},{"$f":"'08'!G46","v":{"$error":"#REF!"}},{"$f":"COUNTIF(C9:C39,\"i\")","v":0},{"$f":"SUM('04'!H46:I46)","v":0}]
[null,{"$f":"'08'!B47","v":"Congé (d) :"},{"$f":"'08'!C47","v":{"$error":"#N/A"}},{"$f":"'08'!D47","v":{"$error":"#REF!"}},{"$f":"'08'!E47","v":{"$error":"#REF!"}},{"$f":"'08'!F47","v":{"$error":"#REF!"}},{"$f":"'08'!G47","v":{"$error":"#REF!"}},{"$f":"COUNTIF(C9:C39,\"d\")+COUNTIF(C9:C39,\"f\")/2","v":0},{"$f":"SUM('04'!H47:I47)","v":0}]
[289,{"$f":"'08'!B48","v":"Vacances (e) :"},{"$f":"'08'!C48","v":{"$error":"#N/A"}},{"$f":"'08'!D48","v":{"$error":"#REF!"}},{"$f":"'08'!E48","v":{"$error":"#REF!"}},{"$f":"'08'!F48","v":{"$error":"#REF!"}},{"$f":"'08'!G48","v":{"$error":"#REF!"}},{"$f":"COUNTIF(C9:C39,\"e\")","v":0},{"$f":"SUM('04'!H48:I48)","v":0},null,null,{"$f":"'08'!L48","v":"Date :"},null,null,{"$f":"'08'!O48","v":"Maître d'apprentissage : "}]
[290,{"$f":"'08'!B49","v":"Accident (g) :"},{"$f":"'08'!C49","v":{"$error":"#N/A"}},{"$f":"'08'!D49","v":{"$error":"#REF!"}},{"$f":"'08'!E49","v":{"$error":"#REF!"}},{"$f":"'08'!F49","v":{"$error":"#REF!"}},{"$f":"'08'!G49","v":{"$error":"#REF!"}},{"$f":"COUNTIF(C9:C39,\"g\")","v":0},{"$f":"SUM('04'!H49:I49)","v":0}]
[291,{"$f":"'08'!B50","v":"Maladie (h) :"},{"$f":"'08'!C50","v":{"$error":"#N/A"}},{"$f":"'08'!D50","v":{"$error":"#REF!"}},{"$f":"'08'!E50","v":{"$error":"#REF!"}},{"$f":"'08'!F50","v":{"$error":"#REF!"}},{"$f":"'08'!G50","v":{"$error":"#REF!"}},{"$f":"COUNTIF(C9:C39,\"h\")","v":0},{"$f":"SUM('04'!H50:I50)","v":0},null,null,null,null,null,{"$f":"'08'!O50","v":"Apprenti(e) : "}]

{"sheet":"06","index":12,"n_rows":50,"n_cols":17,"rows_kept":50,"cut":false,"hidden":false,"merged":[[40,1,40,6],[41,1,41,6],[32,13,33,13],[32,12,33,12],[32,15,33,15],[32,14,33,14],[45,1,45,6],[49,1,49,6],[42,1,42,6],[46,1,46,6],[43,1,43,6],[44,1,44,6],[47,1,47,6],[48,1,48,6],[19,12,19,13],[26,12,26,13],[27,12,27,13],[6,12,6,16],[7,12,7,13],[43,12,45,16],[32,16,33,16],[2,7,7,7],[2,8,7,8],[2,5,7,5],[2,9,7,9],[4,12,4,16],[5,12,5,16],[1,2,1,9],[0,1,0,9],[0,11,0,16],[2,12,2,13],[2,14,2,15],[2,1,7,1],[2,2,7,2],[2,3,7,3],[2,4,7,4],[2,6,7,6]]}
[null,{"$f":"'08'!B1","v":"Agenda"},null,null,null,null,null,null,null,null,null,{"$f":"'08'!L1","v":"Décompte salaire mensuel"}]
[null,{"$f":"'08'!B2","v":"Apprenti(e)"},{"$f":"\"- \" & TRIM(DB_Apprenti) & \" -\"","v":"-  -"}]
[null,{"$f":"DATE(DB_Annee+1,6,1)","v":"2024-06-01"},{"$f":"'08'!C3","v":"[ a-b-c-d-e-f-g-h-i ]"},{"$f":"'08'!D3","v":"Logis"},{"$f":"'08'!E3","v":"Déjeuner"},{"$f":"'08'!F3","v":"Dîner"},{"$f":"'08'!G3","v":"Souper "},{"$f":"'08'!H3","v":"Montant des\n Prestations en\n nature"},{"$f":"'08'!I3","v":"Montant\n modifié"},{"$f":"'08'!J3","v":"Commentaires \na = Jour de travail\nb = Jour de cours professionel\nc = Jour de cours interentreprises\nd = Jour de congé\ne = Jour de vacances\nf = 1/2 jour de travail, 1/2 jour de congé\ng = Accident (jour entier)\nh = Maladie (jour entier)\ni = Armée"},null,{"$f":"'08'!L3","v":"Mois : "},{"$f":"B3","v":"2024-06-01"},null,{"$f":"'08'!O3","v":"Année :"},{"$f":"'08'!P3","v":0},{"$f":"B3","v":"2024-06-01"}]
[null,null,{"$f":"'08'!C4","v":0},{"$f":"'08'!D4","v":0},{"$f":"'08'!E4","v":0},{"$f":"'08'!F4","v":0},{"$f":"'08'!G4","v":0},{"$f":"'08'!H4","v":0},{"$f":"'08'!I4","v":0},{"$f":"'08'!J4","v":0}]
[null,null,{"$f":"'08'!C5","v":0},{"$f":"'08'!D5","v":0},{"$f":"'08'!E5","v":0},{"$f":"'08'!F5","v":0},{"$f":"'08'!G5","v":0},{"$f":"'08'!H5","v":0},{"$f":"'08'!I5","v":0},{"$f":"'08'!J5","v":0},null,{"$f":"'08'!L5","v":"Maître d'apprentissage : "},{"$f":"TRIM(DB_Maitre)","v":""}]
[null,null,{"$f":"'08'!C6","v":0},{"$f":"'08'!D6","v":0},{"$f":"'08'!E6","v":0},{"$f":"'08'!F6","v":0},{"$f":"'08'!G6","v":0},{"$f":"'08'!H6","v":0},{"$f":"'08'!I6","v":0},{"$f":"'08'!J6","v":0},null,{"$f":"'08'!L6","v":"Lieu : "},{"$f":"TRIM(DB_MaitreLieu)","v":""}]
[null,null,{"$f":"'08'!C7","v":0},{"$f":"'08'!D7","v":0},{"$f":"'08'!E7","v":0},{"$f":"'08'!F7","v":0},{"$f":"'08'!G7","v":0},{"$f":"'08'!H7","v":0},{"$f":"'08'!I7","v":0},{"$f":"'08'!J7","v":0},null,{"$f":"'08'!L7","v":"Apprenti : "},{"$f":"TRIM(DB_Apprenti)","v":""}]
[null,null,{"$f":"'08'!C8","v":0},{"$f":"'08'!D8","v":0},{"$f":"'08'!E8","v":0},{"$f":"'08'!F8","v":0},{"$f":"'08'!G8","v":0},{"$f":"'08'!H8","v":0},{"$f":"'08'!I8","v":0},{"$f":"'08'!J8","v":0},null,{"$f":"'08'!L8","v":"N° AVS : "},{"$f":"TRIM(DB_AVS)","v":""},null,null,{"$f":"'08'!P8","v":"Date de naissance :"},{"$f":"IF(DB_DateNaissance=0,\"\",DB_DateNaissance)","v":""}]
[null,{"$f":"B3","v":"2024-06-01"},null,null,null,null,null,{"$f":"MAX(IF(C9=\"a\",PN_Travail,IF(C9=\"b\",PN_CoursProf,IF(C9=\"c\",PN_CoursIE,IF(C9=\"d\",PN_Conge,0)))),IF(C9=\"e\",PN_Vacances,IF(C9=\"f\",PN_DemiJour,IF(C9=\"g\",PN_Accident,IF(C9=\"h\",PN_Maladie,IF(C9=\"i\",PN_Armee,0))))))","v":0},{"$f":"H9+D9*PN_Logis_Plus+E9*PN_Dejeuner_Plus+F9*PN_Diner_Plus+G9*PN_Souper_Plus","v":0}]
[null,{"$f":"B9+1","v":"2024-06-02"},null,null,null,null,null,0,0]
[230,{"$f":"B10+1","v":"2024-06-03"},null,null,null,null,null,0,0,null,null,{"$f":"'08'!L11","v":"Salaire brut"},{"$f":"IF(PN_EffMoy=0,SUBSTITUTE(VLOOKUP(A11+1,Tb_Traduction,DB_Langue,FALSE),\"***\",TEXT(J40,\"0.00\")),\"\")","v":{"$error":"#N/A"}},null,null,null,{"$f":"IF(OR(PN_EffMoy=0,Nb_Mois<>12),Sa_BaseMensuelArrondi / H42 *C40,Sa_BaseMensuelArrondi)","v":{"$error":"#N/A"}}]
[null,"2024-06-04",null,null,null,null,null,0,0,null,null,{"$f":"'08'!L12","v":"Prime, bonus, gratification"}]
[null,"2024-06-05",null,null,null,null,null,0,0,null,null,{"$f":"'08'!L13","v":"Salaire brut total"},null,null,null,null,{"$f":"SUM(Q11:Q12)","v":{"$error":"#N/A"}}]
[null,"2024-06-06",null,null,null,null,null,0,0]
[null,"2024-06-07",null,null,null,null,null,0,0,null,null,{"$f":"'08'!L15","v":"Déductions"},{"$f":"'08'!M15","v":"Part"},"%"]
[null,"2024-06-08",null,null,null,null,null,0,0,null,null,{"$f":"'08'!L16","v":"Cotisations AVS, AI, APG* : "},"1/2",{"$f":"IF(B3>=DB_SoumisAVS,RS_AVS_Plus,0)","v":5.2999999999999999E-2},null,{"$f":"$Q$13*N16","v":{"$error":"#N/A"}}]
[null,"2024-06-09",null,null,null,null,null,0,0,null,null,{"$f":"'08'!L17","v":"Cotisations AC* : "},"1/2",{"$f":"IF(B3>=DB_SoumisAVS,RS_AC_Plus,0)","v":1.0999999999999999E-2},null,{"$f":"$Q$13*N17","v":{"$error":"#N/A"}}]
[null,"2024-06-10",null,null,null,null,null,0,0,null,null,{"$f":"'08'!L18","v":"Accident non profes.: "},"1/1",{"$f":"RS_ANP_Plus","v":1.6070000000000001E-2},null,{"$f":"$Q$13*N18","v":{"$error":"#N/A"}}]
[null,"2024-06-11",null,null,null,null,null,0,0,null,null,{"$f":"'08'!L19","v":"Indemnité journalière MC : "},"1/2",{"$f":"RS_MC_Plus","v":4.4000000000000003E-3},null,{"$f":"$Q$13*N19","v":{"$error":"#N/A"}}]
[null,"2024-06-12",null,null,null,null,null,0,0,null,null,{"$f":"'08'!L20","v":"Autre déduction : "}]
[null,"2024-06-13",null,null,null,null,null,0,0,null,null,{"$f":"'08'!L21","v":{"$error":"#N/A"}},null,null,null,{"$f":"IF(PN_EffMoy=0,I40,IF(Nb_Mois=12,Sa_NatureMensuelArrondi,Sa_NatureMensuelArrondi*C40/H42))","v":{"$error":"#N/A"}}]
[null,"2024-06-14",null,null,null,null,null,0,0,null,null,{"$f":"'08'!L22","v":"*) Dès le 1er janvier de l'année des 18 ans de l'apprenti(e)"}]
[null,"2024-06-15",null,null,null,null,null,0,0]
[null,"2024-06-16",null,null,null,null,null,0,0,null,null,{"$f":"'08'!L24","v":"A déduire"},null,null,null,null,{"$f":"INT((SUM(P16:P21)*20)+0.5)/20","v":{"$error":"#N/A"}}]
[null,"2024-06-17",null,null,null,null,null,0,0]
[null,"2024-06-18",null,null,null,null,null,0,0,null,null,{"$f":"'08'!L26","v":"Frais et remboursement"}]
[null,"2024-06-19",null,null,null,null,null,0,0,null,null,{"$f":"'08'!L27","v":"Frais : "}]
[null,"2024-06-20",null,null,null,null,null,0,0,null,null,{"$f":"'08'!L28","v":"Autre remboursement : "}]
[null,"2024-06-21",null,null,null,null,null,0,0]
[null,"2024-06-22",null,null,null,null,null,0,0,null,null,{"$f":"'08'!L30","v":"A ajouter"},null,null,null,null,{"$f":"SUM(P27:P28)","v":0}]
[null,"2024-06-23",null,null,null,null,null,0,0]
[null,"2024-06-24",null,null,null,null,null,0,0,null,null,{"$f":"'08'!L32","v":"Versement du mois"},null,null,null,null,{"$f":"Q13+Q30-Q24","v":{"$error":"#N/A"}}]
[null,"2024-06-25",null,null,null,null,null,0,0,null,null,null,{"$f":"'08'!M33","v":"Mois\ncourant"},{"$f":"'08'!N33","v":"Cumul mois\nprécédents"},{"$f":"'08'!O33","v":"Prévus\nannuellement"},null,{"$f":"'08'!Q33","v":"Solde\nactuel"}]
[null,"2024-06-26",null,null,null,null,null,0,0,null,null,{"$f":"'08'!L34","v":"Décompte des jours"},{"$f":"'08'!M34","v":0},{"$f":"'08'!N34","v":0},{"$f":"'08'!O34","v":0},null,{"$f":"'08'!Q34","v":0}]
[null,"2024-06-27",null,null,null,null,null,0,0,null,null,{"$f":"'08'!L35","v":"Travail :"},{"$f":"H43","v":0},0,{"$f":"NJ_Travail","v":{"$error":"#N/A"}},null,{"$f":"O35-N35-M35","v":{"$error":"#N/A"}}]
[null,"2024-06-28",null,null,null,null,null,0,0,null,null,{"$f":"'08'!L36","v":"Cours prof. :"},0,0,{"$f":"NJ_CoursProf","v":{"$error":"#N/A"}},null,{"$error":"#N/A"}]
[null,"2024-06-29",null,null,null,null,null,0,0,null,null,{"$f":"'08'!L37","v":"Cours IE :"},0,0,{"$f":"NJ_CoursIE","v":{"$error":"#N/A"}},null,{"$error":"#N/A"}]
[null,"2024-06-30",null,null,null,null,null,0,0,null,null,{"$f":"'08'!L38","v":"Armée :"},0,0,{"$f":"NJ_Bloc","v":0},null,0]
[null,null,null,null,null,null,null,0,0,null,null,{"$f":"'08'!L39","v":"Congés :"},{"$f":"H47","v":0},0,{"$f":"NJ_Conge","v":{"$error":"#N/A"}},null,{"$error":"#N/A"}]
[null,{"$f":"'08'!B40","v":"Total"},{"$f":"COUNTIF(C9:C39,\"a\")+COUNTIF(C9:C39,\"b\")+COUNTIF(C9:C39,\"c\")+COUNTIF(C9:C39,\"d\")+COUNTIF(C9:C39,\"e\")+COUNTIF(C9:C39,\"f\")+COUNTIF(C9:C39,\"g\")+COUNTIF(C9:C39,\"h\")+COUNTIF(C9:C39,\"i\")","v":0},{"$f":"SUM(D9:D39)","v":0},0,0,0,0,0,{"$f":"INT(((Sa_NatureMensuel / H42 *C40)*20)+0.5)/20","v":{"$error":"#N/A"}},null,{"$f":"'08'!L40","v":"Vacances :"},0,0,{"$f":"NJ_Vacances","v":{"$error":"#N/A"}},null,{"$error":"#N/A"}]
[null,null,null,null,null,null,null,{"$f":"B3","v":"2024-06-01"},{"$f":"'08'!I41","v":"cumul"},null,null,{"$f":"'08'!L41","v":"Accident :"},0,0,0,null,0]
[null,{"$f":"'08'!B42","v":"Décompte des jours"},{"$f":"'08'!C42","v":{"$error":"#N/A"}},{"$f":"'08'!D42","v":{"$error":"#REF!"}},{"$f":"'08'!E42","v":{"$error":"#REF!"}},{"$f":"'08'!F42","v":{"$error":"#REF!"}},{"$f":"'08'!G42","v":{"$error":"#REF!"}},30,{"$f":"SUM('05'!H42:I42)","v":305},null,null,{"$f":"'08'!L42","v":"Maladie :"},0,0,0,null,0]
[null,{"$f":"'08'!B43","v":"Jours de travail (a) :"},{"$f":"'08'!C43","v":{"$error":"#N/A"}},{"$f":"'08'!D43","v":{"$error":"#REF!"}},{"$f":"'08'!E43","v":{"$error":"#REF!"}},{"$f":"'08'!F43","v":{"$error":"#REF!"}},{"$f":"'08'!G43","v":{"$error":"#REF!"}},{"$f":"COUNTIF(C9:C39,\"a\")+COUNTIF(C9:C39,\"f\")/2","v":0},{"$f":"SUM('05'!H43:I43)","v":0}]
[null,{"$f":"'08'!B44","v":"Cours professionnels (b) :"},{"$f":"'08'!C44","v":{"$error":"#N/A"}},{"$f":"'08'!D44","v":{"$error":"#REF!"}},{"$f":"'08'!E44","v":{"$error":"#REF!"}},{"$f":"'08'!F44","v":{"$error":"#REF!"}},{"$f":"'08'!G44","v":{"$error":"#REF!"}},{"$f":"COUNTIF(C9:C39,\"b\")","v":0},{"$f":"SUM('05'!H44:I44)","v":0},null,null,{"$f":"'08'!L44","v":"Remarques : "}]
[null,{"$f":"'08'!B45","v":"Cours interentreprises (c) :"},{"$f":"'08'!C45","v":{"$error":"#N/A"}},{"$f":"'08'!D45","v":{"$error":"#REF!"}},{"$f":"'08'!E45","v":{"$error":"#REF!"}},{"$f":"'08'!F45","v":{"$error":"#REF!"}},{"$f":"'08'!G45","v":{"$error":"#REF!"}},{"$f":"COUNTIF(C9:C39,\"c\")","v":0},{"$f":"SUM('05'!H45:I45)","v":0}]
[null,{"$f":"'08'!B46","v":"Armée (i) :"},{"$f":"'08'!C46","v":{"$error":"#N/A"}},{"$f":"'08'!D46","v":{"$error":"#REF!"}},{"$f":"'08'!E46","v":{"$error":"#REF!"}},{"$f":"'08'!F46","v":{"$error":"#REF!"}},{"$f":"'08'!G46","v":{"$error":"#REF!"}},{"$f":"COUNTIF(C9:C39,\"i\")","v":0},{"$f":"SUM('05'!H46:I46)","v":0}]
[null,{"$f":"'08'!B47","v":"Congé (d) :"},{"$f":"'08'!C47","v":{"$error":"#N/A"}},{"$f":"'08'!D47","v":{"$error":"#REF!"}},{"$f":"'08'!E47","v":{"$error":"#REF!"}},{"$f":"'08'!F47","v":{"$error":"#REF!"}},{"$f":"'08'!G47","v":{"$error":"#REF!"}},{"$f":"COUNTIF(C9:C39,\"d\")+COUNTIF(C9:C39,\"f\")/2","v":0},{"$f":"SUM('05'!H47:I47)","v":0}]
[289,{"$f":"'08'!B48","v":"Vacances (e) :"},{"$f":"'08'!C48","v":{"$error":"#N/A"}},{"$f":"'08'!D48","v":{"$error":"#REF!"}},{"$f":"'08'!E48","v":{"$error":"#REF!"}},{"$f":"'08'!F48","v":{"$error":"#REF!"}},{"$f":"'08'!G48","v":{"$error":"#REF!"}},{"$f":"COUNTIF(C9:C39,\"e\")","v":0},{"$f":"SUM('05'!H48:I48)","v":0},null,null,{"$f":"'08'!L48","v":"Date :"},null,null,{"$f":"'08'!O48","v":"Maître d'apprentissage : "}]
[290,{"$f":"'08'!B49","v":"Accident (g) :"},{"$f":"'08'!C49","v":{"$error":"#N/A"}},{"$f":"'08'!D49","v":{"$error":"#REF!"}},{"$f":"'08'!E49","v":{"$error":"#REF!"}},{"$f":"'08'!F49","v":{"$error":"#REF!"}},{"$f":"'08'!G49","v":{"$error":"#REF!"}},{"$f":"COUNTIF(C9:C39,\"g\")","v":0},{"$f":"SUM('05'!H49:I49)","v":0}]
[291,{"$f":"'08'!B50","v":"Maladie (h) :"},{"$f":"'08'!C50","v":{"$error":"#N/A"}},{"$f":"'08'!D50","v":{"$error":"#REF!"}},{"$f":"'08'!E50","v":{"$error":"#REF!"}},{"$f":"'08'!F50","v":{"$error":"#REF!"}},{"$f":"'08'!G50","v":{"$error":"#REF!"}},{"$f":"COUNTIF(C9:C39,\"h\")","v":0},{"$f":"SUM('05'!H50:I50)","v":0},null,null,null,null,null,{"$f":"'08'!O50","v":"Apprenti(e) : "}]

{"sheet":"07","index":13,"n_rows":50,"n_cols":17,"rows_kept":50,"cut":false,"hidden":false,"merged":[[40,1,40,6],[41,1,41,6],[32,13,33,13],[32,12,33,12],[32,15,33,15],[32,14,33,14],[45,1,45,6],[49,1,49,6],[42,1,42,6],[46,1,46,6],[43,1,43,6],[44,1,44,6],[47,1,47,6],[48,1,48,6],[19,12,19,13],[26,12,26,13],[27,12,27,13],[6,12,6,16],[7,12,7,13],[43,12,45,16],[32,16,33,16],[2,7,7,7],[2,8,7,8],[2,5,7,5],[2,9,7,9],[4,12,4,16],[5,12,5,16],[1,2,1,9],[0,1,0,9],[0,11,0,16],[2,12,2,13],[2,14,2,15],[2,1,7,1],[2,2,7,2],[2,3,7,3],[2,4,7,4],[2,6,7,6]]}
[null,{"$f":"'08'!B1","v":"Agenda"},null,null,null,null,null,null,null,null,null,{"$f":"'08'!L1","v":"Décompte salaire mensuel"}]
[null,{"$f":"'08'!B2","v":"Apprenti(e)"},{"$f":"\"- \" & TRIM(DB_Apprenti) & \" -\"","v":"-  -"}]
[null,{"$f":"DATE(DB_Annee+1,7,1)","v":"2024-07-01"},{"$f":"'08'!C3","v":"[ a-b-c-d-e-f-g-h-i ]"},{"$f":"'08'!D3","v":"Logis"},{"$f":"'08'!E3","v":"Déjeuner"},{"$f":"'08'!F3","v":"Dîner"},{"$f":"'08'!G3","v":"Souper "},{"$f":"'08'!H3","v":"Montant des\n Prestations en\n nature"},{"$f":"'08'!I3","v":"Montant\n modifié"},{"$f":"'08'!J3","v":"Commentaires \na = Jour de travail\nb = Jour de cours professionel\nc = Jour de cours interentreprises\nd = Jour de congé\ne = Jour de vacances\nf = 1/2 jour de travail, 1/2 jour de congé\ng = Accident (jour entier)\nh = Maladie (jour entier)\ni = Armée"},null,{"$f":"'08'!L3","v":"Mois : "},{"$f":"B3","v":"2024-07-01"},null,{"$f":"'08'!O3","v":"Année :"},{"$f":"'08'!P3","v":0},{"$f":"B3","v":"2024-07-01"}]
[null,null,{"$f":"'08'!C4","v":0},{"$f":"'08'!D4","v":0},{"$f":"'08'!E4","v":0},{"$f":"'08'!F4","v":0},{"$f":"'08'!G4","v":0},{"$f":"'08'!H4","v":0},{"$f":"'08'!I4","v":0},{"$f":"'08'!J4","v":0}]
[null,null,{"$f":"'08'!C5","v":0},{"$f":"'08'!D5","v":0},{"$f":"'08'!E5","v":0},{"$f":"'08'!F5","v":0},{"$f":"'08'!G5","v":0},{"$f":"'08'!H5","v":0},{"$f":"'08'!I5","v":0},{"$f":"'08'!J5","v":0},null,{"$f":"'08'!L5","v":"Maître d'apprentissage : "},{"$f":"TRIM(DB_Maitre)","v":""}]
[null,null,{"$f":"'08'!C6","v":0},{"$f":"'08'!D6","v":0},{"$f":"'08'!E6","v":0},{"$f":"'08'!F6","v":0},{"$f":"'08'!G6","v":0},{"$f":"'08'!H6","v":0},{"$f":"'08'!I6","v":0},{"$f":"'08'!J6","v":0},null,{"$f":"'08'!L6","v":"Lieu : "},{"$f":"TRIM(DB_MaitreLieu)","v":""}]
[null,null,{"$f":"'08'!C7","v":0},{"$f":"'08'!D7","v":0},{"$f":"'08'!E7","v":0},{"$f":"'08'!F7","v":0},{"$f":"'08'!G7","v":0},{"$f":"'08'!H7","v":0},{"$f":"'08'!I7","v":0},{"$f":"'08'!J7","v":0},null,{"$f":"'08'!L7","v":"Apprenti : "},{"$f":"TRIM(DB_Apprenti)","v":""}]
[null,null,{"$f":"'08'!C8","v":0},{"$f":"'08'!D8","v":0},{"$f":"'08'!E8","v":0},{"$f":"'08'!F8","v":0},{"$f":"'08'!G8","v":0},{"$f":"'08'!H8","v":0},{"$f":"'08'!I8","v":0},{"$f":"'08'!J8","v":0},null,{"$f":"'08'!L8","v":"N° AVS : "},{"$f":"TRIM(DB_AVS)","v":""},null,null,{"$f":"'08'!P8","v":"Date de naissance :"},{"$f":"IF(DB_DateNaissance=0,\"\",DB_DateNaissance)","v":""}]
[null,{"$f":"B3","v":"2024-07-01"},null,null,null,null,null,{"$f":"MAX(IF(C9=\"a\",PN_Travail,IF(C9=\"b\",PN_CoursProf,IF(C9=\"c\",PN_CoursIE,IF(C9=\"d\",PN_Conge,0)))),IF(C9=\"e\",PN_Vacances,IF(C9=\"f\",PN_DemiJour,IF(C9=\"g\",PN_Accident,IF(C9=\"h\",PN_Maladie,IF(C9=\"i\",PN_Armee,0))))))","v":0},{"$f":"H9+D9*PN_Logis_Plus+E9*PN_Dejeuner_Plus+F9*PN_Diner_Plus+G9*PN_Souper_Plus","v":0}]
[null,{"$f":"B9+1","v":"2024-07-02"},null,null,null,null,null,0,0]
[230,{"$f":"B10+1","v":"2024-07-03"},null,null,null,null,null,0,0,null,null,{"$f":"'08'!L11","v":"Salaire brut"},{"$f":"IF(PN_EffMoy=0,SUBSTITUTE(VLOOKUP(A11+1,Tb_Traduction,DB_Langue,FALSE),\"***\",TEXT(J40,\"0.00\")),\"\")","v":{"$error":"#N/A"}},null,null,null,{"$f":"IF(OR(PN_EffMoy=0,Nb_Mois<>12),Sa_BaseMensuelArrondi / H42 *C40,Sa_BaseMensuelArrondi)","v":{"$error":"#N/A"}}]
[null,"2024-07-04",null,null,null,null,null,0,0,null,null,{"$f":"'08'!L12","v":"Prime, bonus, gratification"}]
[null,"2024-07-05",null,null,null,null,null,0,0,null,null,{"$f":"'08'!L13","v":"Salaire brut total"},null,null,null,null,{"$f":"SUM(Q11:Q12)","v":{"$error":"#N/A"}}]
[null,"2024-07-06",null,null,null,null,null,0,0]
[null,"2024-07-07",null,null,null,null,null,0,0,null,null,{"$f":"'08'!L15","v":"Déductions"},{"$f":"'08'!M15","v":"Part"},"%"]
[null,"2024-07-08",null,null,null,null,null,0,0,null,null,{"$f":"'08'!L16","v":"Cotisations AVS, AI, APG* : "},"1/2",{"$f":"IF(B3>=DB_SoumisAVS,RS_AVS_Plus,0)","v":5.2999999999999999E-2},null,{"$f":"$Q$13*N16","v":{"$error":"#N/A"}}]
[null,"2024-07-09",null,null,null,null,null,0,0,null,null,{"$f":"'08'!L17","v":"Cotisations AC* : "},"1/2",{"$f":"IF(B3>=DB_SoumisAVS,RS_AC_Plus,0)","v":1.0999999999999999E-2},null,{"$f":"$Q$13*N17","v":{"$error":"#N/A"}}]
[null,"2024-07-10",null,null,null,null,null,0,0,null,null,{"$f":"'08'!L18","v":"Accident non profes.: "},"1/1",{"$f":"RS_ANP_Plus","v":1.6070000000000001E-2},null,{"$f":"$Q$13*N18","v":{"$error":"#N/A"}}]
[null,"2024-07-11",null,null,null,null,null,0,0,null,null,{"$f":"'08'!L19","v":"Indemnité journalière MC : "},"1/2",{"$f":"RS_MC_Plus","v":4.4000000000000003E-3},null,{"$f":"$Q$13*N19","v":{"$error":"#N/A"}}]
[null,"2024-07-12",null,null,null,null,null,0,0,null,null,{"$f":"'08'!L20","v":"Autre déduction : "}]
[null,"2024-07-13",null,null,null,null,null,0,0,null,null,{"$f":"'08'!L21","v":{"$error":"#N/A"}},null,null,null,{"$f":"IF(PN_EffMoy=0,I40,IF(Nb_Mois=12,Sa_NatureMensuelArrondi,Sa_NatureMensuelArrondi*C40/H42))","v":{"$error":"#N/A"}}]
[null,"2024-07-14",null,null,null,null,null,0,0,null,null,{"$f":"'08'!L22","v":"*) Dès le 1er janvier de l'année des 18 ans de l'apprenti(e)"}]
[null,"2024-07-15",null,null,null,null,null,0,0]
[null,"2024-07-16",null,null,null,null,null,0,0,null,null,{"$f":"'08'!L24","v":"A déduire"},null,null,null,null,{"$f":"INT((SUM(P16:P21)*20)+0.5)/20","v":{"$error":"#N/A"}}]
[null,"2024-07-17",null,null,null,null,null,0,0]
[null,"2024-07-18",null,null,null,null,null,0,0,null,null,{"$f":"'08'!L26","v":"Frais et remboursement"}]
[null,"2024-07-19",null,null,null,null,null,0,0,null,null,{"$f":"'08'!L27","v":"Frais : "}]
[null,"2024-07-20",null,null,null,null,null,0,0,null,null,{"$f":"'08'!L28","v":"Autre remboursement : "}]
[null,"2024-07-21",null,null,null,null,null,0,0]
[null,"2024-07-22",null,null,null,null,null,0,0,null,null,{"$f":"'08'!L30","v":"A ajouter"},null,null,null,null,{"$f":"SUM(P27:P28)","v":0}]
[null,"2024-07-23",null,null,null,null,null,0,0]
[null,"2024-07-24",null,null,null,null,null,0,0,null,null,{"$f":"'08'!L32","v":"Versement du mois"},null,null,null,null,{"$f":"Q13+Q30-Q24","v":{"$error":"#N/A"}}]
[null,"2024-07-25",null,null,null,null,null,0,0,null,null,null,{"$f":"'08'!M33","v":"Mois\ncourant"},{"$f":"'08'!N33","v":"Cumul mois\nprécédents"},{"$f":"'08'!O33","v":"Prévus\nannuellement"},null,{"$f":"'08'!Q33","v":"Solde\nactuel"}]
[null,"2024-07-26",null,null,null,null,null,0,0,null,null,{"$f":"'08'!L34","v":"Décompte des jours"},{"$f":"'08'!M34","v":0},{"$f":"'08'!N34","v":0},{"$f":"'08'!O34","v":0},null,{"$f":"'08'!Q34","v":0}]
[null,"2024-07-27",null,null,null,null,null,0,0,null,null,{"$f":"'08'!L35","v":"Travail :"},{"$f":"H43","v":0},0,{"$f":"NJ_Travail","v":{"$error":"#N/A"}},null,{"$f":"O35-N35-M35","v":{"$error":"#N/A"}}]
[null,"2024-07-28",null,null,null,null,null,0,0,null,null,{"$f":"'08'!L36","v":"Cours prof. :"},0,0,{"$f":"NJ_CoursProf","v":{"$error":"#N/A"}},null,{"$error":"#N/A"}]
[null,"2024-07-29",null,null,null,null,null,0,0,null,null,{"$f":"'08'!L37","v":"Cours IE :"},0,0,{"$f":"NJ_CoursIE","v":{"$error":"#N/A"}},null,{"$error":"#N/A"}]
[null,"2024-07-30",null,null,null,null,null,0,0,null,null,{"$f":"'08'!L38","v":"Armée :"},0,0,{"$f":"NJ_Bloc","v":0},null,0]
[null,"2024-07-31",null,null,null,null,null,0,0,null,null,{"$f":"'08'!L39","v":"Congés :"},{"$f":"H47","v":0},0,{"$f":"NJ_Conge","v":{"$error":"#N/A"}},null,{"$error":"#N/A"}]
[null,{"$f":"'08'!B40","v":"Total"},{"$f":"COUNTIF(C9:C39,\"a\")+COUNTIF(C9:C39,\"b\")+COUNTIF(C9:C39,\"c\")+COUNTIF(C9:C39,\"d\")+COUNTIF(C9:C39,\"e\")+COUNTIF(C9:C39,\"f\")+COUNTIF(C9:C39,\"g\")+COUNTIF(C9:C39,\"h\")+COUNTIF(C9:C39,\"i\")","v":0},{"$f":"SUM(D9:D39)","v":0},0,0,0,0,0,{"$f":"INT(((Sa_NatureMensuel / H42 *C40)*20)+0.5)/20","v":{"$error":"#N/A"}},null,{"$f":"'08'!L40","v":"Vacances :"},0,0,{"$f":"NJ_Vacances","v":{"$error":"#N/A"}},null,{"$error":"#N/A"}]
[null,null,null,null,null,null,null,{"$f":"B3","v":"2024-07-01"},{"$f":"'08'!I41","v":"cumul"},null,null,{"$f":"'08'!L41","v":"Accident :"},0,0,0,null,0]
[null,{"$f":"'08'!B42","v":"Décompte des jours"},{"$f":"'08'!C42","v":{"$error":"#N/A"}},{"$f":"'08'!D42","v":{"$error":"#REF!"}},{"$f":"'08'!E42","v":{"$error":"#REF!"}},{"$f":"'08'!F42","v":{"$error":"#REF!"}},{"$f":"'08'!G42","v":{"$error":"#REF!"}},31,{"$f":"SUM('06'!H42:I42)","v":335},null,null,{"$f":"'08'!L42","v":"Maladie :"},0,0,0,null,0]
[null,{"$f":"'08'!B43","v":"Jours de travail (a) :"},{"$f":"'08'!C43","v":{"$error":"#N/A"}},{"$f":"'08'!D43","v":{"$error":"#REF!"}},{"$f":"'08'!E43","v":{"$error":"#REF!"}},{"$f":"'08'!F43","v":{"$error":"#REF!"}},{"$f":"'08'!G43","v":{"$error":"#REF!"}},{"$f":"COUNTIF(C9:C39,\"a\")+COUNTIF(C9:C39,\"f\")/2","v":0},{"$f":"SUM('06'!H43:I43)","v":0}]
[null,{"$f":"'08'!B44","v":"Cours professionnels (b) :"},{"$f":"'08'!C44","v":{"$error":"#N/A"}},{"$f":"'08'!D44","v":{"$error":"#REF!"}},{"$f":"'08'!E44","v":{"$error":"#REF!"}},{"$f":"'08'!F44","v":{"$error":"#REF!"}},{"$f":"'08'!G44","v":{"$error":"#REF!"}},{"$f":"COUNTIF(C9:C39,\"b\")","v":0},{"$f":"SUM('06'!H44:I44)","v":0},null,null,{"$f":"'08'!L44","v":"Remarques : "}]
[null,{"$f":"'08'!B45","v":"Cours interentreprises (c) :"},{"$f":"'08'!C45","v":{"$error":"#N/A"}},{"$f":"'08'!D45","v":{"$error":"#REF!"}},{"$f":"'08'!E45","v":{"$error":"#REF!"}},{"$f":"'08'!F45","v":{"$error":"#REF!"}},{"$f":"'08'!G45","v":{"$error":"#REF!"}},{"$f":"COUNTIF(C9:C39,\"c\")","v":0},{"$f":"SUM('06'!H45:I45)","v":0}]
[null,{"$f":"'08'!B46","v":"Armée (i) :"},{"$f":"'08'!C46","v":{"$error":"#N/A"}},{"$f":"'08'!D46","v":{"$error":"#REF!"}},{"$f":"'08'!E46","v":{"$error":"#REF!"}},{"$f":"'08'!F46","v":{"$error":"#REF!"}},{"$f":"'08'!G46","v":{"$error":"#REF!"}},{"$f":"COUNTIF(C9:C39,\"i\")","v":0},{"$f":"SUM('06'!H46:I46)","v":0}]
[null,{"$f":"'08'!B47","v":"Congé (d) :"},{"$f":"'08'!C47","v":{"$error":"#N/A"}},{"$f":"'08'!D47","v":{"$error":"#REF!"}},{"$f":"'08'!E47","v":{"$error":"#REF!"}},{"$f":"'08'!F47","v":{"$error":"#REF!"}},{"$f":"'08'!G47","v":{"$error":"#REF!"}},{"$f":"COUNTIF(C9:C39,\"d\")+COUNTIF(C9:C39,\"f\")/2","v":0},{"$f":"SUM('06'!H47:I47)","v":0}]
[289,{"$f":"'08'!B48","v":"Vacances (e) :"},{"$f":"'08'!C48","v":{"$error":"#N/A"}},{"$f":"'08'!D48","v":{"$error":"#REF!"}},{"$f":"'08'!E48","v":{"$error":"#REF!"}},{"$f":"'08'!F48","v":{"$error":"#REF!"}},{"$f":"'08'!G48","v":{"$error":"#REF!"}},{"$f":"COUNTIF(C9:C39,\"e\")","v":0},{"$f":"SUM('06'!H48:I48)","v":0},null,null,{"$f":"'08'!L48","v":"Date :"},null,null,{"$f":"'08'!O48","v":"Maître d'apprentissage : "}]
[290,{"$f":"'08'!B49","v":"Accident (g) :"},{"$f":"'08'!C49","v":{"$error":"#N/A"}},{"$f":"'08'!D49","v":{"$error":"#REF!"}},{"$f":"'08'!E49","v":{"$error":"#REF!"}},{"$f":"'08'!F49","v":{"$error":"#REF!"}},{"$f":"'08'!G49","v":{"$error":"#REF!"}},{"$f":"COUNTIF(C9:C39,\"g\")","v":0},{"$f":"SUM('06'!H49:I49)","v":0}]
[291,{"$f":"'08'!B50","v":"Maladie (h) :"},{"$f":"'08'!C50","v":{"$error":"#N/A"}},{"$f":"'08'!D50","v":{"$error":"#REF!"}},{"$f":"'08'!E50","v":{"$error":"#REF!"}},{"$f":"'08'!F50","v":{"$error":"#REF!"}},{"$f":"'08'!G50","v":{"$error":"#REF!"}},{"$f":"COUNTIF(C9:C39,\"h\")","v":0},{"$f":"SUM('06'!H50:I50)","v":0},null,null,null,null,null,{"$f":"'08'!O50","v":"Apprenti(e) : "}]

{"sheet":"08+","index":14,"n_rows":50,"n_cols":17,"rows_kept":50,"cut":false,"hidden":false,"merged":[[40,1,40,6],[41,1,41,6],[32,13,33,13],[32,12,33,12],[32,15,33,15],[32,14,33,14],[45,1,45,6],[49,1,49,6],[42,1,42,6],[46,1,46,6],[43,1,43,6],[44,1,44,6],[47,1,47,6],[48,1,48,6],[19,12,19,13],[26,12,26,13],[27,12,27,13],[6,12,6,16],[7,12,7,13],[43,12,45,16],[32,16,33,16],[2,7,7,7],[2,8,7,8],[2,5,7,5],[2,9,7,9],[4,12,4,16],[5,12,5,16],[1,2,1,9],[0,1,0,9],[0,11,0,16],[2,12,2,13],[2,14,2,15],[2,1,7,1],[2,2,7,2],[2,3,7,3],[2,4,7,4],[2,6,7,6]]}
[null,{"$f":"'08'!B1","v":"Agenda"},null,null,null,null,null,null,null,null,null,{"$f":"'08'!L1","v":"Décompte salaire mensuel"}]
[null,{"$f":"'08'!B2","v":"Apprenti(e)"},{"$f":"\"- \" & TRIM(DB_Apprenti) & \" -\"","v":"-  -"}]
[null,{"$f":"DATE(DB_Annee+1,8,1)","v":"2024-08-01"},{"$f":"'08'!C3","v":"[ a-b-c-d-e-f-g-h-i ]"},{"$f":"'08'!D3","v":"Logis"},{"$f":"'08'!E3","v":"Déjeuner"},{"$f":"'08'!F3","v":"Dîner"},{"$f":"'08'!G3","v":"Souper "},{"$f":"'08'!H3","v":"Montant des\n Prestations en\n nature"},{"$f":"'08'!I3","v":"Montant\n modifié"},{"$f":"'08'!J3","v":"Commentaires \na = Jour de travail\nb = Jour de cours professionel\nc = Jour de cours interentreprises\nd = Jour de congé\ne = Jour de vacances\nf = 1/2 jour de travail, 1/2 jour de congé\ng = Accident (jour entier)\nh = Maladie (jour entier)\ni = Armée"},null,{"$f":"'08'!L3","v":"Mois : "},{"$f":"B3","v":"2024-08-01"},null,{"$f":"'08'!O3","v":"Année :"},{"$f":"'08'!P3","v":0},{"$f":"B3","v":"2024-08-01"}]
[null,null,{"$f":"'08'!C4","v":0},{"$f":"'08'!D4","v":0},{"$f":"'08'!E4","v":0},{"$f":"'08'!F4","v":0},{"$f":"'08'!G4","v":0},{"$f":"'08'!H4","v":0},{"$f":"'08'!I4","v":0},{"$f":"'08'!J4","v":0}]
[null,null,{"$f":"'08'!C5","v":0},{"$f":"'08'!D5","v":0},{"$f":"'08'!E5","v":0},{"$f":"'08'!F5","v":0},{"$f":"'08'!G5","v":0},{"$f":"'08'!H5","v":0},{"$f":"'08'!I5","v":0},{"$f":"'08'!J5","v":0},null,{"$f":"'08'!L5","v":"Maître d'apprentissage : "},{"$f":"TRIM(DB_Maitre)","v":""}]
[null,null,{"$f":"'08'!C6","v":0},{"$f":"'08'!D6","v":0},{"$f":"'08'!E6","v":0},{"$f":"'08'!F6","v":0},{"$f":"'08'!G6","v":0},{"$f":"'08'!H6","v":0},{"$f":"'08'!I6","v":0},{"$f":"'08'!J6","v":0},null,{"$f":"'08'!L6","v":"Lieu : "},{"$f":"TRIM(DB_MaitreLieu)","v":""}]
[null,null,{"$f":"'08'!C7","v":0},{"$f":"'08'!D7","v":0},{"$f":"'08'!E7","v":0},{"$f":"'08'!F7","v":0},{"$f":"'08'!G7","v":0},{"$f":"'08'!H7","v":0},{"$f":"'08'!I7","v":0},{"$f":"'08'!J7","v":0},null,{"$f":"'08'!L7","v":"Apprenti : "},{"$f":"TRIM(DB_Apprenti)","v":""}]
[null,null,{"$f":"'08'!C8","v":0},{"$f":"'08'!D8","v":0},{"$f":"'08'!E8","v":0},{"$f":"'08'!F8","v":0},{"$f":"'08'!G8","v":0},{"$f":"'08'!H8","v":0},{"$f":"'08'!I8","v":0},{"$f":"'08'!J8","v":0},null,{"$f":"'08'!L8","v":"N° AVS : "},{"$f":"TRIM(DB_AVS)","v":""},null,null,{"$f":"'08'!P8","v":"Date de naissance :"},{"$f":"IF(DB_DateNaissance=0,\"\",DB_DateNaissance)","v":""}]
[null,{"$f":"B3","v":"2024-08-01"},null,null,null,null,null,{"$f":"MAX(IF(C9=\"a\",PN_Travail,IF(C9=\"b\",PN_CoursProf,IF(C9=\"c\",PN_CoursIE,IF(C9=\"d\",PN_Conge,0)))),IF(C9=\"e\",PN_Vacances,IF(C9=\"f\",PN_DemiJour,IF(C9=\"g\",PN_Accident,IF(C9=\"h\",PN_Maladie,IF(C9=\"i\",PN_Armee,0))))))","v":0},{"$f":"H9+D9*PN_Logis_Plus+E9*PN_Dejeuner_Plus+F9*PN_Diner_Plus+G9*PN_Souper_Plus","v":0}]
[null,{"$f":"B9+1","v":"2024-08-02"},null,null,null,null,null,0,0]
[230,{"$f":"B10+1","v":"2024-08-03"},null,null,null,null,null,0,0,null,null,{"$f":"'08'!L11","v":"Salaire brut"},{"$f":"IF(PN_EffMoy=0,SUBSTITUTE(VLOOKUP(A11+1,Tb_Traduction,DB_Langue,FALSE),\"***\",TEXT(J40,\"0.00\")),\"\")","v":{"$error":"#N/A"}},null,null,null,{"$f":"IF(OR(PN_EffMoy=0,Nb_Mois<>12),Sa_BaseMensuelArrondi / H42 *C40,Sa_BaseMensuelArrondi*PN_SalMoyAoutPlus)","v":{"$error":"#N/A"}}]
[null,"2024-08-04",null,null,null,null,null,0,0,null,null,{"$f":"'08'!L12","v":"Prime, bonus, gratification"}]
[null,"2024-08-05",null,null,null,null,null,0,0,null,null,{"$f":"'08'!L13","v":"Salaire brut total"},null,null,null,null,{"$f":"SUM(Q11:Q12)","v":{"$error":"#N/A"}}]
[null,"2024-08-06",null,null,null,null,null,0,0]
[null,"2024-08-07",null,null,null,null,null,0,0,null,null,{"$f":"'08'!L15","v":"Déductions"},{"$f":"'08'!M15","v":"Part"},"%"]
[null,"2024-08-08",null,null,null,null,null,0,0,null,null,{"$f":"'08'!L16","v":"Cotisations AVS, AI, APG* : "},"1/2",{"$f":"IF(B3>=DB_SoumisAVS,RS_AVS_Plus,0)","v":5.2999999999999999E-2},null,{"$f":"$Q$13*N16","v":{"$error":"#N/A"}}]
[null,"2024-08-09",null,null,null,null,null,0,0,null,null,{"$f":"'08'!L17","v":"Cotisations AC* : "},"1/2",{"$f":"IF(B3>=DB_SoumisAVS,RS_AC_Plus,0)","v":1.0999999999999999E-2},null,{"$f":"$Q$13*N17","v":{"$error":"#N/A"}}]
[null,"2024-08-10",null,null,null,null,null,0,0,null,null,{"$f":"'08'!L18","v":"Accident non profes.: "},"1/1",{"$f":"RS_ANP_Plus","v":1.6070000000000001E-2},null,{"$f":"$Q$13*N18","v":{"$error":"#N/A"}}]
[null,"2024-08-11",null,null,null,null,null,0,0,null,null,{"$f":"'08'!L19","v":"Indemnité journalière MC : "},"1/2",{"$f":"RS_MC_Plus","v":4.4000000000000003E-3},null,{"$f":"$Q$13*N19","v":{"$error":"#N/A"}}]
[null,"2024-08-12",null,null,null,null,null,0,0,null,null,{"$f":"'08'!L20","v":"Autre déduction : "}]
[null,"2024-08-13",null,null,null,null,null,0,0,null,null,{"$f":"'08'!L21","v":{"$error":"#N/A"}},null,null,null,{"$f":"IF(PN_EffMoy=0,I40,IF(Nb_Mois=12,Sa_NatureMensuelArrondi*PN_SalMoyAoutPlus,Sa_NatureMensuelArrondi*C40/H42))","v":{"$error":"#N/A"}}]
[null,"2024-08-14",null,null,null,null,null,0,0,null,null,{"$f":"'08'!L22","v":"*) Dès le 1er janvier de l'année des 18 ans de l'apprenti(e)"}]
[null,"2024-08-15",null,null,null,null,null,0,0]
[null,"2024-08-16",null,null,null,null,null,0,0,null,null,{"$f":"'08'!L24","v":"A déduire"},null,null,null,null,{"$f":"INT((SUM(P16:P21)*20)+0.5)/20","v":{"$error":"#N/A"}}]
[null,"2024-08-17",null,null,null,null,null,0,0]
[null,"2024-08-18",null,null,null,null,null,0,0,null,null,{"$f":"'08'!L26","v":"Frais et remboursement"}]
[null,"2024-08-19",null,null,null,null,null,0,0,null,null,{"$f":"'08'!L27","v":"Frais : "}]
[null,"2024-08-20",null,null,null,null,null,0,0,null,null,{"$f":"'08'!L28","v":"Autre remboursement : "}]
[null,"2024-08-21",null,null,null,null,null,0,0]
[null,"2024-08-22",null,null,null,null,null,0,0,null,null,{"$f":"'08'!L30","v":"A ajouter"},null,null,null,null,{"$f":"SUM(P27:P28)","v":0}]
[null,"2024-08-23",null,null,null,null,null,0,0]
[null,"2024-08-24",null,null,null,null,null,0,0,null,null,{"$f":"'08'!L32","v":"Versement du mois"},null,null,null,null,{"$f":"Q13+Q30-Q24","v":{"$error":"#N/A"}}]
[null,"2024-08-25",null,null,null,null,null,0,0,null,null,null,{"$f":"'08'!M33","v":"Mois\ncourant"},{"$f":"'08'!N33","v":"Cumul mois\nprécédents"},{"$f":"'08'!O33","v":"Prévus\nannuellement"},null,{"$f":"'08'!Q33","v":"Solde\nactuel"}]
[null,"2024-08-26",null,null,null,null,null,0,0,null,null,{"$f":"'08'!L34","v":"Décompte des jours"},{"$f":"'08'!M34","v":0},{"$f":"'08'!N34","v":0},{"$f":"'08'!O34","v":0},null,{"$f":"'08'!Q34","v":0}]
[null,"2024-08-27",null,null,null,null,null,0,0,null,null,{"$f":"'08'!L35","v":"Travail :"},{"$f":"H43","v":0},0,{"$f":"NJ_Travail","v":{"$error":"#N/A"}},null,{"$f":"O35-N35-M35","v":{"$error":"#N/A"}}]
[null,"2024-08-28",null,null,null,null,null,0,0,null,null,{"$f":"'08'!L36","v":"Cours prof. :"},0,0,{"$f":"NJ_CoursProf","v":{"$error":"#N/A"}},null,{"$error":"#N/A"}]
[null,"2024-08-29",null,null,null,null,null,0,0,null,null,{"$f":"'08'!L37","v":"Cours IE :"},0,0,{"$f":"NJ_CoursIE","v":{"$error":"#N/A"}},null,{"$error":"#N/A"}]
[null,"2024-08-30",null,null,null,null,null,0,0,null,null,{"$f":"'08'!L38","v":"Armée :"},0,0,{"$f":"NJ_Bloc","v":0},null,0]
[null,"2024-08-31",null,null,null,null,null,0,0,null,null,{"$f":"'08'!L39","v":"Congés :"},{"$f":"H47","v":0},0,{"$f":"NJ_Conge","v":{"$error":"#N/A"}},null,{"$error":"#N/A"}]
[null,{"$f":"'08'!B40","v":"Total"},{"$f":"COUNTIF(C9:C39,\"a\")+COUNTIF(C9:C39,\"b\")+COUNTIF(C9:C39,\"c\")+COUNTIF(C9:C39,\"d\")+COUNTIF(C9:C39,\"e\")+COUNTIF(C9:C39,\"f\")+COUNTIF(C9:C39,\"g\")+COUNTIF(C9:C39,\"h\")+COUNTIF(C9:C39,\"i\")","v":0},{"$f":"SUM(D9:D39)","v":0},0,0,0,0,0,{"$f":"INT(((Sa_NatureMensuel / H42 *C40)*20)+0.5)/20","v":{"$error":"#N/A"}},null,{"$f":"'08'!L40","v":"Vacances :"},0,0,{"$f":"NJ_Vacances","v":{"$error":"#N/A"}},null,{"$error":"#N/A"}]
[null,null,null,null,null,null,null,{"$f":"B3","v":"2024-08-01"},{"$f":"'08'!I41","v":"cumul"},null,null,{"$f":"'08'!L41","v":"Accident :"},0,0,0,null,0]
[null,{"$f":"'08'!B42","v":"Décompte des jours"},{"$f":"'08'!C42","v":{"$error":"#N/A"}},{"$f":"'08'!D42","v":{"$error":"#REF!"}},{"$f":"'08'!E42","v":{"$error":"#REF!"}},{"$f":"'08'!F42","v":{"$error":"#REF!"}},{"$f":"'08'!G42","v":{"$error":"#REF!"}},31,{"$f":"SUM('07'!H42:I42)","v":366},null,null,{"$f":"'08'!L42","v":"Maladie :"},0,0,0,null,0]
[null,{"$f":"'08'!B43","v":"Jours de travail (a) :"},{"$f":"'08'!C43","v":{"$error":"#N/A"}},{"$f":"'08'!D43","v":{"$error":"#REF!"}},{"$f":"'08'!E43","v":{"$error":"#REF!"}},{"$f":"'08'!F43","v":{"$error":"#REF!"}},{"$f":"'08'!G43","v":{"$error":"#REF!"}},{"$f":"COUNTIF(C9:C39,\"a\")+COUNTIF(C9:C39,\"f\")/2","v":0},{"$f":"SUM('07'!H43:I43)","v":0}]
[null,{"$f":"'08'!B44","v":"Cours professionnels (b) :"},{"$f":"'08'!C44","v":{"$error":"#N/A"}},{"$f":"'08'!D44","v":{"$error":"#REF!"}},{"$f":"'08'!E44","v":{"$error":"#REF!"}},{"$f":"'08'!F44","v":{"$error":"#REF!"}},{"$f":"'08'!G44","v":{"$error":"#REF!"}},{"$f":"COUNTIF(C9:C39,\"b\")","v":0},{"$f":"SUM('07'!H44:I44)","v":0},null,null,{"$f":"'08'!L44","v":"Remarques : "}]
[null,{"$f":"'08'!B45","v":"Cours interentreprises (c) :"},{"$f":"'08'!C45","v":{"$error":"#N/A"}},{"$f":"'08'!D45","v":{"$error":"#REF!"}},{"$f":"'08'!E45","v":{"$error":"#REF!"}},{"$f":"'08'!F45","v":{"$error":"#REF!"}},{"$f":"'08'!G45","v":{"$error":"#REF!"}},{"$f":"COUNTIF(C9:C39,\"c\")","v":0},{"$f":"SUM('07'!H45:I45)","v":0}]
[null,{"$f":"'08'!B46","v":"Armée (i) :"},{"$f":"'08'!C46","v":{"$error":"#N/A"}},{"$f":"'08'!D46","v":{"$error":"#REF!"}},{"$f":"'08'!E46","v":{"$error":"#REF!"}},{"$f":"'08'!F46","v":{"$error":"#REF!"}},{"$f":"'08'!G46","v":{"$error":"#REF!"}},{"$f":"COUNTIF(C9:C39,\"i\")","v":0},{"$f":"SUM('07'!H46:I46)","v":0}]
[null,{"$f":"'08'!B47","v":"Congé (d) :"},{"$f":"'08'!C47","v":{"$error":"#N/A"}},{"$f":"'08'!D47","v":{"$error":"#REF!"}},{"$f":"'08'!E47","v":{"$error":"#REF!"}},{"$f":"'08'!F47","v":{"$error":"#REF!"}},{"$f":"'08'!G47","v":{"$error":"#REF!"}},{"$f":"COUNTIF(C9:C39,\"d\")+COUNTIF(C9:C39,\"f\")/2","v":0},{"$f":"SUM('07'!H47:I47)","v":0}]
[289,{"$f":"'08'!B48","v":"Vacances (e) :"},{"$f":"'08'!C48","v":{"$error":"#N/A"}},{"$f":"'08'!D48","v":{"$error":"#REF!"}},{"$f":"'08'!E48","v":{"$error":"#REF!"}},{"$f":"'08'!F48","v":{"$error":"#REF!"}},{"$f":"'08'!G48","v":{"$error":"#REF!"}},{"$f":"COUNTIF(C9:C39,\"e\")","v":0},{"$f":"SUM('07'!H48:I48)","v":0},null,null,{"$f":"'08'!L48","v":"Date :"},null,null,{"$f":"'08'!O48","v":"Maître d'apprentissage : "}]
[290,{"$f":"'08'!B49","v":"Accident (g) :"},{"$f":"'08'!C49","v":{"$error":"#N/A"}},{"$f":"'08'!D49","v":{"$error":"#REF!"}},{"$f":"'08'!E49","v":{"$error":"#REF!"}},{"$f":"'08'!F49","v":{"$error":"#REF!"}},{"$f":"'08'!G49","v":{"$error":"#REF!"}},{"$f":"COUNTIF(C9:C39,\"g\")","v":0},{"$f":"SUM('07'!H49:I49)","v":0}]
[291,{"$f":"'08'!B50","v":"Maladie (h) :"},{"$f":"'08'!C50","v":{"$error":"#N/A"}},{"$f":"'08'!D50","v":{"$error":"#REF!"}},{"$f":"'08'!E50","v":{"$error":"#REF!"}},{"$f":"'08'!F50","v":{"$error":"#REF!"}},{"$f":"'08'!G50","v":{"$error":"#REF!"}},{"$f":"COUNTIF(C9:C39,\"h\")","v":0},{"$f":"SUM('07'!H50:I50)","v":0},null,null,null,null,null,{"$f":"'08'!O50","v":"Apprenti(e) : "}]

{"sheet":"Année-Jahr","index":15,"n_rows":43,"n_cols":18,"rows_kept":43,"cut":false,"hidden":false,"merged":[[33,14,33,16],[23,14,23,15],[21,8,25,8],[22,14,22,17],[27,14,27,16],[28,14,28,16],[31,14,31,16],[41,14,41,16],[42,14,42,16],[29,14,29,16],[40,14,40,16],[39,14,39,16],[38,14,38,16],[36,14,36,16],[30,14,30,16],[37,14,37,16],[32,14,32,16],[21,1,25,1],[21,2,25,2],[21,3,25,3],[21,4,25,4],[21,10,25,10],[21,9,25,9],[0,2,0,3],[20,14,20,17],[21,14,21,17],[24,14,24,15],[21,7,25,7],[21,6,25,6],[20,2,20,9],[21,5,25,5],[0,5,0,10],[0,12,0,13]]}
[300,null,{"$f":"VLOOKUP(A1,Tb_Traduction,DB_Langue,FALSE)","v":"Salaire"},null,null,{"$f":"VLOOKUP(A1+1,Tb_Traduction,DB_Langue,FALSE)","v":"Déductions"},null,null,null,null,null,null,{"$f":"VLOOKUP(A1+2,Tb_Traduction,DB_Langue,FALSE)","v":"Frais et remb."}]
[310,{"$f":"VLOOKUP(A2,Tb_Traduction,DB_Langue,FALSE)","v":"Mois"},{"$f":"VLOOKUP(A2+1,Tb_Traduction,DB_Langue,FALSE)","v":"Salaire brut"},{"$f":"VLOOKUP(A2+2,Tb_Traduction,DB_Langue,FALSE)","v":"Prime, bonus, gratification"},{"$f":"VLOOKUP(A2+3,Tb_Traduction,DB_Langue,FALSE)","v":"Salaire brut total"},{"$f":"VLOOKUP(A2+4,Tb_Traduction,DB_Langue,FALSE)","v":"Cotisations AVS, AI, APG"},{"$f":"VLOOKUP(A2+5,Tb_Traduction,DB_Langue,FALSE)","v":"Cotisations AC"},{"$f":"VLOOKUP(A2+6,Tb_Traduction,DB_Langue,FALSE)","v":" Accident non profes."},{"$f":"VLOOKUP(A2+7,Tb_Traduction,DB_Langue,FALSE)","v":"Indemnité journalière MC"},{"$f":"VLOOKUP(A2+8,Tb_Traduction,DB_Langue,FALSE)","v":"Autre déduction"},{"$f":"VLOOKUP(A2+9,Tb_Traduction,DB_Langue,FALSE)","v":"Salaire en nature effectif"},{"$f":"VLOOKUP(A2+10,Tb_Traduction,DB_Langue,FALSE)","v":"A déduire"},{"$f":"VLOOKUP(A2+11,Tb_Traduction,DB_Langue,FALSE)","v":"Frais"},{"$f":"VLOOKUP(A2+12,Tb_Traduction,DB_Langue,FALSE)","v":"Autre remboursement"},{"$f":"VLOOKUP(A2+13,Tb_Traduction,DB_Langue,FALSE)","v":"A ajouter"},{"$f":"VLOOKUP(A2+14,Tb_Traduction,DB_Langue,FALSE)","v":"Versement du mois"},{"$f":"VLOOKUP(A2+15,Tb_Traduction,DB_Langue,FALSE)","v":"Versement effectif"},{"$f":"VLOOKUP(A2+16,Tb_Traduction,DB_Langue,FALSE)","v":"Différence"}]
[null,{"$f":"'08'!B3","v":"2023-08-01"},{"$f":"'08'!Q11","v":{"$error":"#N/A"}},{"$f":"'08'!Q12","v":0},{"$f":"C3+D3","v":{"$error":"#N/A"}},{"$f":"'08'!P16","v":{"$error":"#N/A"}},{"$f":"'08'!P17","v":{"$error":"#N/A"}},{"$f":"'08'!P18","v":{"$error":"#N/A"}},{"$f":"'08'!P19","v":{"$error":"#N/A"}},{"$f":"'08'!P20","v":0},{"$f":"'08'!I40","v":0},{"$f":"SUM(F3:K3)","v":{"$error":"#N/A"}},{"$f":"'08'!P27","v":0},{"$f":"'08'!P28","v":0},{"$f":"SUM(M3:N3)","v":0},{"$f":"E3-L3+O3","v":{"$error":"#N/A"}},null,{"$f":"P3-Q3","v":{"$error":"#N/A"}}]
[null,{"$f":"'09'!B3","v":"2023-09-01"},{"$f":"'09'!Q11","v":{"$error":"#N/A"}},{"$f":"'09'!Q12","v":0},{"$f":"C4+D4","v":{"$error":"#N/A"}},{"$f":"'09'!P16","v":{"$error":"#N/A"}},{"$f":"'09'!P17","v":{"$error":"#N/A"}},{"$f":"'09'!P18","v":{"$error":"#N/A"}},{"$f":"'09'!P19","v":{"$error":"#N/A"}},{"$f":"'09'!P20","v":0},{"$f":"'09'!I40","v":0},{"$error":"#N/A"},{"$f":"'09'!P27","v":0},{"$f":"'09'!P28","v":0},0,{"$error":"#N/A"},null,{"$error":"#N/A"}]
[null,{"$f":"'10'!B3","v":"2023-10-01"},{"$f":"'10'!Q11","v":{"$error":"#N/A"}},{"$f":"'10'!Q12","v":0},{"$error":"#N/A"},{"$f":"'10'!P16","v":{"$error":"#N/A"}},{"$f":"'10'!P17","v":{"$error":"#N/A"}},{"$f":"'10'!P18","v":{"$error":"#N/A"}},{"$f":"'10'!P19","v":{"$error":"#N/A"}},{"$f":"'10'!P20","v":0},{"$f":"'10'!I40","v":0},{"$error":"#N/A"},{"$f":"'10'!P27","v":0},{"$f":"'10'!P28","v":0},0,{"$error":"#N/A"},null,{"$error":"#N/A"}]
[null,{"$f":"'11'!B3","v":"2023-11-01"},{"$f":"'11'!Q11","v":{"$error":"#N/A"}},{"$f":"'11'!Q12","v":0},{"$error":"#N/A"},{"$f":"'11'!P16","v":{"$error":"#N/A"}},{"$f":"'11'!P17","v":{"$error":"#N/A"}},{"$f":"'11'!P18","v":{"$error":"#N/A"}},{"$f":"'11'!P19","v":{"$error":"#N/A"}},{"$f":"'11'!P20","v":0},{"$f":"'11'!I40","v":0},{"$error":"#N/A"},{"$f":"'11'!P27","v":0},{"$f":"'11'!P28","v":0},0,{"$error":"#N/A"},null,{"$error":"#N/A"}]
[null,{"$f":"'12'!B3","v":"2023-12-01"},{"$f":"'12'!Q11","v":{"$error":"#N/A"}},{"$f":"'12'!Q12","v":0},{"$error":"#N/A"},{"$f":"'12'!P16","v":{"$error":"#N/A"}},{"$f":"'12'!P17","v":{"$error":"#N/A"}},{"$f":"'12'!P18","v":{"$error":"#N/A"}},{"$f":"'12'!P19","v":{"$error":"#N/A"}},{"$f":"'12'!P20","v":0},{"$f":"'12'!I40","v":0},{"$error":"#N/A"},{"$f":"'12'!P27","v":0},{"$f":"'12'!P28","v":0},0,{"$error":"#N/A"},null,{"$error":"#N/A"}]
[null,{"$f":"'01'!B3","v":"2024-01-01"},{"$f":"'01'!Q11","v":{"$error":"#N/A"}},{"$f":"'01'!Q12","v":0},{"$error":"#N/A"},{"$f":"'01'!P16","v":{"$error":"#N/A"}},{"$f":"'01'!P17","v":{"$error":"#N/A"}},{"$f":"'01'!P18","v":{"$error":"#N/A"}},{"$f":"'01'!P19","v":{"$error":"#N/A"}},{"$f":"'01'!P20","v":0},{"$f":"'01'!I40","v":0},{"$error":"#N/A"},{"$f":"'01'!P27","v":0},{"$f":"'01'!P28","v":0},0,{"$error":"#N/A"},null,{"$error":"#N/A"}]
[null,{"$f":"'02'!B3","v":"2024-02-01"},{"$f":"'02'!Q11","v":{"$error":"#N/A"}},{"$f":"'02'!Q12","v":0},{"$error":"#N/A"},{"$f":"'02'!P16","v":{"$error":"#N/A"}},{"$f":"'02'!P17","v":{"$error":"#N/A"}},{"$f":"'02'!P18","v":{"$error":"#N/A"}},{"$f":"'02'!P19","v":{"$error":"#N/A"}},{"$f":"'02'!P20","v":0},{"$f":"'02'!I40","v":0},{"$error":"#N/A"},{"$f":"'02'!P27","v":0},{"$f":"'02'!P28","v":0},0,{"$error":"#N/A"},null,{"$error":"#N/A"}]
[null,{"$f":"'03'!B3","v":"2024-03-01"},{"$f":"'03'!Q11","v":{"$error":"#N/A"}},{"$f":"'03'!Q12","v":0},{"$error":"#N/A"},{"$f":"'03'!P16","v":{"$error":"#N/A"}},{"$f":"'03'!P17","v":{"$error":"#N/A"}},{"$f":"'03'!P18","v":{"$error":"#N/A"}},{"$f":"'03'!P19","v":{"$error":"#N/A"}},{"$f":"'03'!P20","v":0},{"$f":"'03'!I40","v":0},{"$error":"#N/A"},{"$f":"'03'!P27","v":0},{"$f":"'03'!P28","v":0},0,{"$error":"#N/A"},null,{"$error":"#N/A"}]
[null,{"$f":"'04'!B3","v":"2024-04-01"},{"$f":"'04'!Q11","v":{"$error":"#N/A"}},{"$f":"'04'!Q12","v":0},{"$error":"#N/A"},{"$f":"'04'!P16","v":{"$error":"#N/A"}},{"$f":"'04'!P17","v":{"$error":"#N/A"}},{"$f":"'04'!P18","v":{"$error":"#N/A"}},{"$f":"'04'!P19","v":{"$error":"#N/A"}},{"$f":"'04'!P20","v":0},{"$f":"'04'!I40","v":0},{"$error":"#N/A"},{"$f":"'04'!P27","v":0},{"$f":"'04'!P28","v":0},0,{"$error":"#N/A"},null,{"$error":"#N/A"}]
[null,{"$f":"'05'!B3","v":"2024-05-01"},{"$f":"'05'!Q11","v":{"$error":"#N/A"}},{"$f":"'05'!Q12","v":0},{"$error":"#N/A"},{"$f":"'05'!P16","v":{"$error":"#N/A"}},{"$f":"'05'!P17","v":{"$error":"#N/A"}},{"$f":"'05'!P18","v":{"$error":"#N/A"}},{"$f":"'05'!P19","v":{"$error":"#N/A"}},{"$f":"'05'!P20","v":0},{"$f":"'05'!I40","v":0},{"$error":"#N/A"},{"$f":"'05'!P27","v":0},{"$f":"'05'!P28","v":0},0,{"$error":"#N/A"},null,{"$error":"#N/A"}]
[null,{"$f":"'06'!B3","v":"2024-06-01"},{"$f":"'06'!Q11","v":{"$error":"#N/A"}},{"$f":"'06'!Q12","v":0},{"$error":"#N/A"},{"$f":"'06'!P16","v":{"$error":"#N/A"}},{"$f":"'06'!P17","v":{"$error":"#N/A"}},{"$f":"'06'!P18","v":{"$error":"#N/A"}},{"$f":"'06'!P19","v":{"$error":"#N/A"}},{"$f":"'06'!P20","v":0},{"$f":"'06'!I40","v":0},{"$error":"#N/A"},{"$f":"'06'!P27","v":0},{"$f":"'06'!P28","v":0},0,{"$error":"#N/A"},null,{"$error":"#N/A"}]
[null,{"$f":"'07'!B3","v":"2024-07-01"},{"$f":"'07'!Q11","v":{"$error":"#N/A"}},{"$f":"'07'!Q12","v":0},{"$error":"#N/A"},{"$f":"'07'!P16","v":{"$error":"#N/A"}},{"$f":"'07'!P17","v":{"$error":"#N/A"}},{"$f":"'07'!P18","v":{"$error":"#N/A"}},{"$f":"'07'!P19","v":{"$error":"#N/A"}},{"$f":"'07'!P20","v":0},{"$f":"'07'!I40","v":0},{"$error":"#N/A"},{"$f":"'07'!P27","v":0},{"$f":"'07'!P28","v":0},0,{"$error":"#N/A"},null,{"$error":"#N/A"}]
[null,{"$f":"'08+'!B3","v":"2024-08-01"},{"$f":"'08+'!Q11","v":{"$error":"#N/A"}},{"$f":"'08+'!Q12","v":0},{"$error":"#N/A"},{"$f":"'08+'!P16","v":{"$error":"#N/A"}},{"$f":"'08+'!P17","v":{"$error":"#N/A"}},{"$f":"'08+'!P18","v":{"$error":"#N/A"}},{"$f":"'08+'!P19","v":{"$error":"#N/A"}},{"$f":"'08+'!P20","v":0},{"$f":"'08+'!I40","v":0},{"$error":"#N/A"},{"$f":"'08+'!P27","v":0},{"$f":"'08+'!P28","v":0},0,{"$error":"#N/A"},null,{"$error":"#N/A"}]
[330,{"$f":"VLOOKUP(A16,Tb_Traduction,DB_Langue,FALSE)","v":"Totaux"},{"$f":"SUM(C3:C15)","v":{"$error":"#N/A"}},{"$f":"SUM(D3:D15)","v":0},{"$f":"SUM(E3:E15)","v":{"$error":"#N/A"}},{"$f":"SUM(F3:F15)","v":{"$error":"#N/A"}},{"$error":"#N/A"},{"$error":"#N/A"},{"$error":"#N/A"},0,0,{"$error":"#N/A"},{"$f":"SUM(M3:M15)","v":0},0,0,{"$error":"#N/A"},0,{"$error":"#N/A"}]
[331,{"$f":"VLOOKUP(A17,Tb_Traduction,DB_Langue,FALSE)","v":"Valeurs prévues"},{"$f":"Sa_BaseAnnuel","v":0},null,{"$f":"C17+D16","v":0},null,null,null,null,null,{"$f":"Sa_NatureAnnuel","v":{"$error":"#N/A"}}]
[332,{"$f":"VLOOKUP(A18,Tb_Traduction,DB_Langue,FALSE)","v":"Différences"},{"$f":"C17-C16","v":{"$error":"#N/A"}},null,{"$f":"E17-E16","v":{"$error":"#N/A"}},null,null,null,null,null,{"$f":"K17-K16","v":{"$error":"#N/A"}}]
[]
[]
[340,null,{"$f":"VLOOKUP(A21,Tb_Traduction,DB_Langue,FALSE)","v":"Décompte des jours"},null,null,null,null,null,null,null,null,null,null,{"$f":"VLOOKUP(A21+1,Tb_Traduction,DB_Langue,FALSE)","v":"Maître d'apprentissage : "},{"$f":"TRIM(DB_Maitre)","v":""}]
[342,{"$f":"VLOOKUP(A26,Tb_Traduction,DB_Langue,FALSE)","v":"Mois"},{"$f":"VLOOKUP(A26+1,Tb_Traduction,DB_Langue,FALSE)","v":"Travail"},{"$f":"VLOOKUP(A26+2,Tb_Traduction,DB_Langue,FALSE)","v":"Cours prof."},{"$f":"VLOOKUP(A26+3,Tb_Traduction,DB_Langue,FALSE)","v":"Cours IE"},{"$f":"VLOOKUP(A26+9,Tb_Traduction,DB_Langue,FALSE)","v":"Armée"},{"$f":"VLOOKUP(A26+4,Tb_Traduction,DB_Langue,FALSE)","v":"Congés"},{"$f":"VLOOKUP(A26+5,Tb_Traduction,DB_Langue,FALSE)","v":"Vacances"},{"$f":"VLOOKUP(A26+6,Tb_Traduction,DB_Langue,FALSE)","v":"Accident"},{"$f":"VLOOKUP(A26+7,Tb_Traduction,DB_Langue,FALSE)","v":"Maladie"},{"$f":"VLOOKUP(A26+8,Tb_Traduction,DB_Langue,FALSE)","v":"Total"},null,null,{"$f":"VLOOKUP(A22,Tb_Traduction,DB_Langue,FALSE)","v":"Lieu : "},{"$f":"TRIM(DB_MaitreLieu)","v":""}]
[343,null,null,null,null,null,null,null,null,null,null,null,null,{"$f":"VLOOKUP(A23,Tb_Traduction,DB_Langue,FALSE)","v":"Apprenti : "},{"$f":"TRIM(DB_Apprenti)","v":""}]
[344,null,null,null,null,null,null,null,null,null,null,null,null,{"$f":"VLOOKUP(A24,Tb_Traduction,DB_Langue,FALSE)","v":"N° AVS : "},{"$f":"TRIM(DB_AVS)","v":""}]
[345,null,null,null,null,null,null,null,null,null,null,null,null,{"$f":"VLOOKUP(A25,Tb_Traduction,DB_Langue,FALSE)","v":"Date de naissance : "},{"$f":"IF(DB_DateNaissance=0,\"\",DB_DateNaissance)","v":""}]
[350]
[null,{"$f":"'08'!B3","v":"2023-08-01"},{"$f":"'08'!M35","v":0},{"$f":"'08'!M36","v":0},{"$f":"'08'!M37","v":0},{"$f":"'08'!M38","v":0},{"$f":"'08'!M39","v":0},{"$f":"'08'!M40","v":0},{"$f":"'08'!M41","v":0},{"$f":"'08'!M42","v":0},{"$f":"SUM(C27:J27)","v":0}]
[360,{"$f":"'09'!B3","v":"2023-09-01"},{"$f":"'09'!M35","v":0},{"$f":"'09'!M36","v":0},{"$f":"'09'!M37","v":0},{"$f":"'09'!M38","v":0},{"$f":"'09'!M39","v":0},{"$f":"'09'!M40","v":0},{"$f":"'09'!M41","v":0},{"$f":"'09'!M42","v":0},0,null,null,null,{"$f":"VLOOKUP(A28,Tb_Traduction,DB_Langue,FALSE)","v":"Attestation de salaire août-déc."},null,null,{"$f":"DB_Annee","v":2023}]
[361,{"$f":"'10'!B3","v":"2023-10-01"},{"$f":"'10'!M35","v":0},{"$f":"'10'!M36","v":0},{"$f":"'10'!M37","v":0},{"$f":"'10'!M38","v":0},{"$f":"'10'!M39","v":0},{"$f":"'10'!M40","v":0},{"$f":"'10'!M41","v":0},{"$f":"'10'!M42","v":0},0,null,null,null,"Salaire brut : ",null,null,{"$f":"SUM(E3:E7)","v":{"$error":"#N/A"}}]
[362,{"$f":"'11'!B3","v":"2023-11-01"},{"$f":"'11'!M35","v":0},{"$f":"'11'!M36","v":0},{"$f":"'11'!M37","v":0},{"$f":"'11'!M38","v":0},{"$f":"'11'!M39","v":0},{"$f":"'11'!M40","v":0},{"$f":"'11'!M41","v":0},{"$f":"'11'!M42","v":0},0,null,null,null,"Cotisations AVS, AI, APG : ",null,null,{"$f":"SUM(F3:F7)","v":{"$error":"#N/A"}}]
[363,{"$f":"'12'!B3","v":"2023-12-01"},{"$f":"'12'!M35","v":0},{"$f":"'12'!M36","v":0},{"$f":"'12'!M37","v":0},{"$f":"'12'!M38","v":0},{"$f":"'12'!M39","v":0},{"$f":"'12'!M40","v":0},{"$f":"'12'!M41","v":0},{"$f":"'12'!M42","v":0},0,null,null,null,"Cotisations AC : ",null,null,{"$f":"SUM(G3:G7)","v":{"$error":"#N/A"}}]
[364,{"$f":"'01'!B3","v":"2024-01-01"},{"$f":"'01'!M35","v":0},{"$f":"'01'!M36","v":0},{"$f":"'01'!M37","v":0},{"$f":"'01'!M38","v":0},{"$f":"'01'!M39","v":0},{"$f":"'01'!M40","v":0},{"$f":"'01'!M41","v":0},{"$f":"'01'!M42","v":0},0,null,null,null," Accident non profes. : ",null,null,{"$f":"SUM(H3:H7)","v":{"$error":"#N/A"}}]
[317,{"$f":"'02'!B3","v":"2024-02-01"},{"$f":"'02'!M35","v":0},{"$f":"'02'!M36","v":0},{"$f":"'02'!M37","v":0},{"$f":"'02'!M38","v":0},{"$f":"'02'!M39","v":0},{"$f":"'02'!M40","v":0},{"$f":"'02'!M41","v":0},{"$f":"'02'!M42","v":0},0,null,null,null,"Indemnité journalière MC",null,null,{"$f":"SUM(I3:I7)","v":{"$error":"#N/A"}}]
[365,{"$f":"'03'!B3","v":"2024-03-01"},{"$f":"'03'!M35","v":0},{"$f":"'03'!M36","v":0},{"$f":"'03'!M37","v":0},{"$f":"'03'!M38","v":0},{"$f":"'03'!M39","v":0},{"$f":"'03'!M40","v":0},{"$f":"'03'!M41","v":0},{"$f":"'03'!M42","v":0},0,null,null,null,"Salaire net : ",null,null,{"$f":"R29-SUM(R30:R33)","v":{"$error":"#N/A"}}]
[null,{"$f":"'04'!B3","v":"2024-04-01"},{"$f":"'04'!M35","v":0},{"$f":"'04'!M36","v":0},{"$f":"'04'!M37","v":0},{"$f":"'04'!M38","v":0},{"$f":"'04'!M39","v":0},{"$f":"'04'!M40","v":0},{"$f":"'04'!M41","v":0},{"$f":"'04'!M42","v":0},0]
[null,{"$f":"'05'!B3","v":"2024-05-01"},{"$f":"'05'!M35","v":0},{"$f":"'05'!M36","v":0},{"$f":"'05'!M37","v":0},{"$f":"'05'!M38","v":0},{"$f":"'05'!M39","v":0},{"$f":"'05'!M40","v":0},{"$f":"'05'!M41","v":0},{"$f":"'05'!M42","v":0},0]
[366,{"$f":"'06'!B3","v":"2024-06-01"},{"$f":"'06'!M35","v":0},{"$f":"'06'!M36","v":0},{"$f":"'06'!M37","v":0},{"$f":"'06'!M38","v":0},{"$f":"'06'!M39","v":0},{"$f":"'06'!M40","v":0},{"$f":"'06'!M41","v":0},{"$f":"'06'!M42","v":0},0,null,null,null,{"$f":"VLOOKUP(A37,Tb_Traduction,DB_Langue,FALSE)","v":"Attestation de salaire jan.-août"},null,null,{"$f":"R28+1","v":2024}]
[null,{"$f":"'07'!B3","v":"2024-07-01"},{"$f":"'07'!M35","v":0},{"$f":"'07'!M36","v":0},{"$f":"'07'!M37","v":0},{"$f":"'07'!M38","v":0},{"$f":"'07'!M39","v":0},{"$f":"'07'!M40","v":0},{"$f":"'07'!M41","v":0},{"$f":"'07'!M42","v":0},0,null,null,null,{"$f":"O29","v":"Salaire brut : "},null,null,{"$f":"SUM(E8:E15)","v":{"$error":"#N/A"}}]
[null,{"$f":"'08+'!B3","v":"2024-08-01"},{"$f":"'08+'!M35","v":0},{"$f":"'08+'!M36","v":0},{"$f":"'08+'!M37","v":0},{"$f":"'08+'!M38","v":0},{"$f":"'08+'!M39","v":0},{"$f":"'08+'!M40","v":0},{"$f":"'08+'!M41","v":0},{"$f":"'08+'!M42","v":0},0,null,null,null,"Cotisations AVS, AI, APG : ",null,null,{"$f":"SUM(F8:F15)","v":{"$error":"#N/A"}}]
[370,{"$f":"VLOOKUP(A40,Tb_Traduction,DB_Langue,FALSE)","v":"Totaux"},{"$f":"SUM(C27:C39)","v":0},0,0,0,0,0,0,0,0,null,null,null,"Cotisations AC : ",null,null,{"$f":"SUM(G8:G15)","v":{"$error":"#N/A"}}]
[371,{"$f":"VLOOKUP(A41,Tb_Traduction,DB_Langue,FALSE)","v":"Valeurs prévues"},{"$f":"NJ_Travail","v":{"$error":"#N/A"}},{"$f":"NJ_CoursProf","v":{"$error":"#N/A"}},{"$f":"NJ_CoursIE","v":{"$error":"#N/A"}},{"$f":"NJ_Bloc","v":0},{"$f":"NJ_Conge","v":{"$error":"#N/A"}},{"$f":"NJ_Vacances","v":{"$error":"#N/A"}},0,0,{"$f":"SUM(C41:J41)","v":{"$error":"#N/A"}},null,null,null," Accident non profes. : ",null,null,{"$f":"SUM(H8:H15)","v":{"$error":"#N/A"}}]
[372,{"$f":"VLOOKUP(A42,Tb_Traduction,DB_Langue,FALSE)","v":"Différences"},{"$f":"C41-C40","v":{"$error":"#N/A"}},{"$f":"D41-D40","v":{"$error":"#N/A"}},{"$error":"#N/A"},0,{"$error":"#N/A"},{"$error":"#N/A"},0,0,{"$error":"#N/A"},null,null,null,"Indemnité journalière MC",null,null,{"$f":"SUM(I8:I15)","v":{"$error":"#N/A"}}]
[null,null,null,null,null,null,null,null,null,null,null,null,null,null,"Salaire net : ",null,null,{"$f":"R38-SUM(R39:R42)","v":{"$error":"#N/A"}}]

{"sheet":"Texte","index":16,"n_rows":197,"n_cols":3,"rows_kept":197,"cut":false,"hidden":true,"merged":[]}
["N°","Français","Deutsch"]
[1,"Salaire et nombre de jours","Lohn und Tagesanzahl"]
[2,"Salaire annuel de base (minimum)","Bruttolohn (minimum)"]
[3,"Salaire annuel en nature (sans chambre)","Naturallohn pro Jahr (ohne Zimmer)"]
[4,"Salaire annuel en nature (avec chambre)","Naturallohn pro Jahr (mit Zimmer)"]
[5,"Sal. annuel en nat. (chambre hors sem. bloc)","Naturallohn pro Jahr (Zimmer ausserhalb Blockw.)"]
[6,"Durée totale","Vertragsdauer"]
[7,"Jours de congé","Freitage"]
[8,"Vacances","Ferien"]
[9,"Cours professionnel","Schultage"]
[10,"Cours interentreprises","üK"]
[11,"Jours en semaine bloc (inc. congé et vac.)","Tagen in Blockwochen (inkl. Ferien + Freitage)"]
[12,"Jours de travail","Arbeitstage"]
[13,"Nombre de mois","Anzahl Monaten"]
[14,"Les normes cantonales concernant le salaire sont consultables ici:","Kantonalen Standards in Bezug auf die Löhne sind hier verfügbar"]
[15,"Les normes cantonales concernant les vacances sont consultables ici:","Kantonalen Standards in Bezug auf die Ferien sind hier verfügbar"]
[100,"Langue :","Sprache"]
[101,"D ou F","D oder F"]
[110,"Nom et prénom du maître d'apprentissage :","Name und Vorname Berufsbildnerin / Berufsbildner"]
[111,"Adresse :","Adresse"]
[112,"NPA et Lieu :","PLZ und Ort"]
[120,"Nom et prénom de l'apprenti(e) :","Name und Vorname der / des Lernenden"]
[121,"Adresse :","Adresse"]
[122,"NPA et Lieu :","PLZ und Ort"]
[123,"N° AVS :","AHV-Nummer"]
[124,"Date de naissance :","Geburtsdatum"]
[125,"Soumis à l'AVS depuis :","AHV-Pflichtig seit"]
[126,"Supplément de vacances jusqu'à 20 ans révolus :","Extra-Urlaub bis zu 20 Jahren vorbei"]
[130,"Année :","Jahr"]
[131,"Année d'apprentissage :","Lehrjahr"]
[132,"(1, 2, 3a ou 3b)","(1, 2, 3a oder 3b)"]
[133,"Nombre de mois :","Anzahl Monaten"]
[135,"Versement mensuel moyen :","Durchschnittliche Auszahlung pro Monat"]
[136,"sans AVS, moins de 18 ans :","ohne AHV, unter 18 Jahren:"]
[137,"avec AVS, dès 18 ans :","mit AHV, über 18 Jahren:"]
[140,"Données salariales","Lohndaten"]
[141,"Net","Netto "]
[142,"Arrondi","Gerundet"]
[143,"Salaire annuel de base minimum :","Minimaler Jahreslohn:"]
[144,"Salaire annuel de base :","Jahreslohn"]
[145,"Salaire mensuel de base :","Monatslohn"]
[146,"Salaire annuel en nature :","Naturallohn pro Jahr"]
[147,"Salaire mensuel en nature :","Naturallohn pro Monat"]
[148,"Salaire mensuel moyen :","Durchschnittliche Monatslohn"]
[149,"Ne pas modifier le salaire annuel en cours d'année !","Den Lohn während des Jahres nicht ändern !"]
[150,"Prestations en nature","Naturallohnansätze"]
[151,"Logis :","Übernachtung"]
[152,"Déjeuner :","Morgenessen"]
[153,"Dîner :","Mittagessen"]
[154,"Souper :","Abendessen"]
[155,"Chambre à disposition (oui/non/bloc) :","Zimmer zur Verfügung (ja/nein/Blockwochen)"]
[156,"Afficher dans le décompte le salaire en nature effectif ou mensuel (moyenne)","In der Abrechnung den effektiven oder monatlichen (Durschnitt) Naturallohn anzeigen"]
[157,"Si salaire en nature mensuel, indiquer la répartition des salaires août ***1 et ***2","Wenn monatlicher Naturallohn, Lohnaufteilung August ***1 und ***2 angeben"]
[158,"Cette option est incompatible avec la variante sélectionnée !","Diese Option ist nicht kompatibel mit der selektierte Variant !"]
[159,"Si le nombre de mois est différents de 12, le calcul du salaire en nature moyen ne sera peut-être pas exact !","Wenn die Anzahl der Monate ist anders als 12, kann die Berechnung der Naturallohn pro Monat nicht ganz exakt sein !"]
[160,"Prestations en nature par jour","Naturallohnansätze pro Tag"]
[161,"Nb. Jours","Anz. Tage"]
[162,"Jours de travail :","Arbeitstage"]
[163,"Cours professionnels :","Schultage"]
[164,"Cours interentreprises :","üK"]
[165,"Congé :","Freitage"]
[166,"Vacances :","Ferien"]
[167,"1/2 jour (travail/congé) :","halbe (Arbeitstage/Freitage)"]
[168,"Accident :","Unfall"]
[169,"Maladie :","Krankheit"]
[170,"Nb. de jours total :","Total anzahl Tage"]
[171,"Armée :","Militär"]
[180,"Retenues sur le salaire","Lohnrückbehalte"]
[181,"Cotisations AVS, AI, APG :","Beiträge AHV, IV, EO"]
[182,"Cotisations AC :","Beiträge ALV"]
[183," Accident non professionnel :","Nichtbetriebsunfall"]
[184,"Indemnité journalière en cas de  maladie :","Krankentaggeld"]
[200,"Agenda","Agenda"]
[201,"Décompte salaire mensuel","Monatliche Lohnabrechnung"]
[202,"Apprenti(e)","Lerndende / r"]
[203,"Mois : ","Monat:"]
[204,"Année :","Jahr:"]
[210,"[ a-b-c-d-e-f-g-h-i ]","[ a-b-c-d-e-f-g-h-i ]"]
[211,"Logis","Übernachtung"]
[212,"Déjeuner","Morgenessen"]
[213,"Dîner","Mittagessen"]
[214,"Souper ","Abendessen"]
[215,"Montant des\n Prestations en\n nature","Betrag Naturallohn"]
[216,"Montant\n modifié","Angepasster Betrag"]
[217,"Commentaires \na = Jour de travail\nb = Jour de cours professionel\nc = Jour de cours interentreprises\nd = Jour de congé\ne = Jour de vacances\nf = 1/2 jour de travail, 1/2 jour de congé\ng = Accident (jour entier)\nh = Maladie (jour entier)\ni = Armée","Kommentar\na = Arbeitstag\nb = Schultag\nc = überbetrieblicher Kurs (üK)\nd = Freitag\ne = Ferientag\nf = 1/2 Arbeitstag, 1/2 Freitag\ng = Unfall (ganz Tag)\nh = Krankheit (ganz Tag)\ni = Miltär"]
[220,"Maître d'apprentissage : ","Berufsbildner"]
[221,"Lieu : ","Ort"]
[222,"Apprenti : ","Lernende / r"]
[223,"N° AVS : ","AHV-Nummer"]
[224,"Date de naissance :","Geburtsdatum"]
[230,"Salaire brut","Bruttolohn  "]
[231,"Dont Fr. *** en nature (selon barême AVS)","Wovon Fr. *** Naturallohn (nach AHV)"]
[232,"Prime, bonus, gratification","Prämie, Bonus, Gratifikation"]
[233,"Salaire brut total","Bruttolohn total"]
[240,"Déductions","Abzüge"]
[241,"Part","Anteil"]
[242,"Cotisations AVS, AI, APG* : ","Beiträge AHV, IV, EO*:"]
[243,"Cotisations AC* : ","Beiträge ALV*:"]
[244,"Accident non profes.: ","Nichtbetriebsunfall:"]
[245,"Indemnité journalière MC : ","Krankentaggeld:"]
[246,"Autre déduction : ","Anderer Abzug:"]
[247,"Salaire en nature effectif : ","Effektive Naturallohn:"]
[248,"Salaire en nature mensuel : ","Monatliche Naturallohn:"]
[249,"*) Dès le 1er janvier de l'année des 18 ans de l'apprenti(e)","*) sofern pflichtig"]
[250,"A déduire","Total Abzüge"]
[251,"Frais et remboursement","Rückvergügungen"]
[252,"Frais : ","Kostenbeteiligungen"]
[253,"Autre remboursement : ","Übrige Rückvergütungen"]
[254,"A ajouter","Zuschläge"]
[255,"Versement du mois","Netto-Auszahlung"]
[260,"Décompte des jours","Tagesabrechnung"]
[261,"Mois\ncourant","aktueller\nMonat"]
[262,"Cumul mois\nprécédents","Summe der\nVormonate"]
[263,"Prévus\nannuellement","Jahresvor-\nanschlag:"]
[264,"Solde\nactuel","Aktueller\nSaldo"]
[265,"Travail :","Arbeit:"]
[266,"Cours prof. :","Schultage:"]
[267,"Cours IE :","üK:"]
[268,"Congés :","Frei:"]
[269,"Vacances :","Ferien:"]
[270,"Accident :","Unfall:"]
[271,"Maladie :","Krankheit:"]
[272,"Armée :","Militär:"]
[275,"Total","Total"]
[276,"Remarques : ","Bemerkungen:"]
[277,"cumul","Total"]
[280,"Décompte des jours","Tagesabrechnung"]
[281,"Jours de travail (a) :","Arbeitstage ( a )"]
[282,"Cours professionnels (b) :","Schultage ( b )"]
[283,"Date :","Datum"]
[284,"Maître d'apprentissage : ","Berufsbildner /in"]
[285,"Cours interentreprises (c) :","überbetriebliche Kurse ( c )"]
[286,"Congé (d) :","Frei ( d )"]
[287,"Apprenti(e) : ","Lernende /r"]
[288,"Vacances (e) :","Ferien ( e )"]
[289,"Accident (g) :","Unfall ( g )"]
[290,"Maladie (h) :","Krankheit ( h )"]
[291,"Armée (i) :","Militär ( i )"]
[300,"Salaire","Lohn   "]
[301,"Déductions","Abzüge"]
[302,"Frais et remb.","Rückvergügungen"]
[310,"Mois","Monat"]
[311,"Salaire brut","Bruttolohn"]
[312,"Prime, bonus, gratification","Prämie, Bonus, Gratifikation"]
[313,"Salaire brut total","Bruttolohn total"]
[314,"Cotisations AVS, AI, APG","Abzüge AHV, IV"]
[315,"Cotisations AC","Abzüge ALV"]
[316," Accident non profes.","Nichtbetriebsunfall"]
[317,"Indemnité journalière MC","Krankentaggeld"]
[318,"Autre déduction","Übrige Abzüge"]
[319,"Salaire en nature effectif","Effektiver Naturallohn"]
[320,"A déduire","Abzüge"]
[321,"Frais","Kostenbeteiligungen"]
[322,"Autre remboursement","Übrige Rückvergütungen"]
[323,"A ajouter","Zuschläge"]
[324,"Versement du mois","Monatsauszahlung"]
[325,"Versement effectif","Effektive Auszahlung"]
[326,"Différence","Differenz"]
[330,"Totaux","Total"]
[331,"Valeurs prévues","Vorgesehene Werte"]
[332,"Différences","Differenz"]
[340,"Décompte des jours","Tagesabrechnung"]
[341,"Maître d'apprentissage : ","Berufsbildner /in"]
[342,"Lieu : ","Ort"]
[343,"Apprenti : ","Lernende /r"]
[344,"N° AVS : ","AHV-Nummer"]
[345,"Date de naissance : ","Geburtsdatum"]
[350,"Mois","Monat"]
[351,"Travail","Arbeit"]
[352,"Cours prof.","Schultage"]
[353,"Cours IE","üK"]
[354,"Congés","Frei"]
[355,"Vacances","Ferien"]
[356,"Accident","Unfall"]
[357,"Maladie","Krankheit"]
[358,"Total","Total"]
[359,"Armée","Militär"]
[360,"Attestation de salaire août-déc.","Lohn Aug-Dec"]
[361,"Salaire brut : ","Bruttolohn"]
[362,"Cotisations AVS, AI, APG : ","Abzüge AHV, IV, EO"]
[363,"Cotisations AC : ","Abzüge ALV"]
[364," Accident non profes. : ","Nichtbetriebsunfall"]
[365,"Salaire net : ","Nettolohn"]
[366,"Attestation de salaire jan.-août","Lohn Jan-Aug"]
[370,"Totaux","Total"]
[371,"Valeurs prévues","Vorgesehene Werte"]
[372,"Différences","Differenz"]
[400,"Vous ne devez remplir que les cellules jaunes !!!","Bitte nur die gelben zellen ausfüllen!"]
[401,"Pour chaque jour du mois vous pouvez saisir ici la journée de l'apprenti","Geben Sie für jeden Tag die Beschäftigung der / des Lernenden ein (a bis h)"]
[402,"a = Journée de travail\nb = Journée de cours professionnels\nc = Journée de cours interentreprises\nd = Journée de congé\ne = Journée de vacances\nf = 1/2 jour de travail, 1/2 jour de congé\ng = Accident (jour entier)\nh = Maladie (jour entier)\ni = Armée","a = Arbeitstag\nb = Schultag\nc = überbetrieblicher Kurs (üK)\nd = Freitag\ne = Ferientag\nf = 1/2 Arbeitstag, 1/2 Freitag\ng = Unfall (ganz Tag)\nh = Krankheit (ganz Tag)\ni = Militär"]
[403,"Une cellule rouge indique une mauvaise saisie. Seules les valeurs a, b, c, d, e, f, g ou h peuvent être saisie ici.","Eine rote Zelle zeigt eine Falscheingabe an. Nur die Werte a, b, c, d, e, f, g oder h können eingegeben werden."]
[404,"Les cases rouges indiquent les prestations en nature décomptées pour la journée.","Die roten Felder zeigen die Naturallohnabzüge pro Tag an."]
[405,"Le montant des prestations en nature est calculé automatiquement","Der Naturallohnabzug wird automatisch berechnet."]
[406,"Pour chaque jour, vous pouvez ajouter ou soustraire une ou plusieurs prestations en nature ","Für jeden Tag können Sie eine oder mehrere Mahlzeiten hinzufügen oder entfernen."]
[407,"Le montant modifié des prestations en nature est calculé automatiquement","Der angepasste Betrag des Naturallohns wird automatisch berechnet. "]
[408,"Le total mensuel des prestations en nature est reporté dans le décompte salaire du mois si on affiche le montant effectif du salaire en nature. Sinon on reporte le salaire en nature mensuel","Das Total der Naturallohnabzüge wird in die Monatsabrechnung übertragen, wenn der effektive Naturallohn angezeigt wird. Sonst wird der monatliche Naturallohn übertragt."]
[409,"Le décompte des jours est reporté dans le décompte salaire du mois","Die Tagesabrechnung wird in die Monatsabrechnung übertragen."]

{"sheet":"Données de base-Grunddaten","index":17,"n_rows":45,"n_cols":5,"rows_kept":45,"cut":false,"hidden":true,"merged":[[0,1,0,4],[18,1,18,2],[26,1,26,2],[13,1,13,2]]}
[null,"Choix des listes déroulantes / Wahl der Dropdown-Liste"]
[]
[null,"Langue / Sprache"]
[null,"Valeurs / Werte"]
[null,"F"]
[null,"D"]
[]
[null,"Oui/Non / Ja/Nein"]
[null,"Valeurs / Werte","Français","Deutsch"]
[null,{"$f":"IF(DB_Langue=2,C10,D10)","v":"OUI"},"OUI","JA"]
[null,{"$f":"IF(DB_Langue=2,C11,D11)","v":"NON"},"NON","NEIN"]
[null,{"$f":"IF(DB_Langue=2,C12,D12)","v":"en dehors des semaines bloc"},"en dehors des semaines bloc","nur ausserhalb Blockwochen"]
[]
[null,"Effectif/Moyen / Effektiv/Durschnitt"]
[null,"Affichage","Valeurs / Werte","Français","Deutsch"]
[null,{"$f":"IF(DB_Langue=2,D16,E16)","v":"Salaire en nature effectif"},0,"Salaire en nature effectif","Effektiver Naturallohn"]
[null,{"$f":"IF(DB_Langue=2,D17,E17)","v":"Salaire en nature mensuel"},1,"Salaire en nature mensuel","Monatlicher Naturallohn"]
[]
[null,"Année d'apprentissage / Lehrjahr"]
[null,"Valeurs / Werte","Descriptions / Beschreibungen","Français","Deutsch"]
[null,1,{"$f":"IF(DB_Langue=2,D21,E21)","v":"1ère année d'apprentissage"},"1ère année d'apprentissage","1. Lehrjahr"]
[null,"2b",{"$f":"IF(DB_Langue=2,D22,E22)","v":"2ème année d'apprentissage"},"2ème année d'apprentissage","2. Lehrjahr"]
[null,"2f",{"$f":"IF(DB_Langue=2,D23,E23)","v":"2ème année (8 jours de cours IE)"},"2ème année (8 jours de cours IE)","2. Lehrjahr (8 Tagen ük)"]
[null,3,{"$f":"IF(DB_Langue=2,D24,E24)","v":"3ème année d'apprentissage (toute l'année)"},"3ème année d'apprentissage (toute l'année)","3. Lehrjahr (ganzes Jahr)"]
[]
[]
[null,"Catégorie / Kategorie"]
[null,"Valeurs / Werte","Descriptions / Beschreibungen","Français","Deutsch"]
[null,"a",{"$f":"IF(DB_Langue=2,D29,E29)","v":"Travail"},"Travail","Arbeitstag"]
[null,"b","Cours professionnel","Cours professionnel","Schultag"]
[null,"c","Cours interentreprise","Cours interentreprise","üK"]
[null,"d","Congé","Congé","Freitag"]
[null,"e","Vacances","Vacances","Ferien"]
[null,"f","1/2 jour (travail/congé)","1/2 jour (travail/congé)","halbe (Arbeitstag/Freitag):"]
[null,"g","Accident","Accident","Unfall"]
[null,"h","Maladie","Maladie","Krankheit"]
[null,"i","Armée","Armée","Militär"]
[]
[]
[null,"Nombre / Anzahl"]
[null,"Valeurs / Werte"]
[null,"-1"]
[null,-0.5]
[null,0.5]
[null,"1"]